client_id,joined,income,credit_score,join_month,log_income
42320,2000-04-27,229481,563,4,12.343575516384542
39384,2000-06-18,191204,617,6,12.1610961998827
26945,2000-11-26,214516,806,11,12.27613960664295
41472,2001-11-06,152214,638,11,11.933042704410708
46180,2001-11-06,43851,562,11,10.688552802557403
46109,2002-04-16,172677,527,4,12.059178076342683
32885,2002-05-13,58955,642,5,10.984529720010773
29841,2002-08-17,38354,523,8,10.554614103833462
38537,2002-10-21,127183,643,10,11.753382273157754
35214,2003-08-08,95849,696,8,11.470529315451188
49068,2004-02-12,128813,603,2,11.76611701923615
26326,2004-05-06,227920,633,5,12.33674996917179
26695,2004-08-27,174532,680,8,12.069863384901188
44601,2004-10-20,156341,518,10,11.959794798069588
32726,2006-05-01,235705,730,5,12.370336302106095
25707,2006-10-06,211422,621,10,12.261611415120877
49545,2007-11-14,104564,770,11,11.557554603113433
48177,2008-06-09,190632,769,6,12.158100146981077
32961,2009-04-07,230341,714,4,12.347316098621828
44387,2009-07-14,151903,781,7,11.930997438224257
35089,2010-03-01,131176,771,3,11.784295211929704
46958,2011-07-22,225709,644,7,12.327001837952118
39505,2011-10-14,153873,610,10,11.94388286583933
49624,2012-08-04,49036,800,8,10.800310001214886
41480,2013-03-11,122607,585,3,11.71673939710228
