Copyright 1986-2018 Xilinx, Inc. All Rights Reserved.
------------------------------------------------------------------------------------------------------------------------------------------
| Tool Version : Vivado v.2018.3 (lin64) Build 2405991 Thu Dec  6 23:36:41 MST 2018
| Date         : Mon Mar  4 20:07:41 2024
| Host         : Kamil-Laptop running 64-bit Debian GNU/Linux 12 (bookworm)
| Command      : report_bus_skew -warn_on_violation -file zad_bus_skew_routed.rpt -pb zad_bus_skew_routed.pb -rpx zad_bus_skew_routed.rpx
| Design       : zad
| Device       : 7a100t-csg324
| Speed File   : -1  PRODUCTION 1.23 2018-06-13
------------------------------------------------------------------------------------------------------------------------------------------

Bus Skew Report

No bus skew constraints

