{
    "fluentMethods": true,
    "relationships": [
        {
            "relationshipName": "game",
            "otherEntityName": "game",
            "relationshipType": "many-to-one",
            "relationshipValidateRules": [
                "required"
            ],
            "otherEntityField": "id"
        },
        {
            "relationshipName": "user",
            "otherEntityName": "user",
            "relationshipType": "many-to-one",
            "otherEntityField": "login",
            "ownerSide": true,
            "otherEntityRelationshipName": "bet"
        }
    ],
    "fields": [
        {
            "fieldName": "date",
            "fieldType": "Instant"
        },
        {
            "fieldName": "hostResult",
            "fieldType": "Integer",
            "fieldValidateRules": [
                "required",
                "min",
                "max"
            ],
            "fieldValidateRulesMin": "0",
            "fieldValidateRulesMax": "20"
        },
        {
            "fieldName": "guestResult",
            "fieldType": "Integer",
            "fieldValidateRules": [
                "required",
                "min",
                "max"
            ],
            "fieldValidateRulesMin": "0",
            "fieldValidateRulesMax": "20"
        },
        {
            "fieldName": "type",
            "fieldType": "Integer"
        },
        {
            "fieldName": "winner",
            "fieldType": "Integer"
        }
    ],
    "changelogDate": "20180526093323",
    "dto": "no",
    "service": "no",
    "entityTableName": "bet",
    "jpaMetamodelFiltering": false,
    "pagination": "no"
}
