{
    "fluentMethods": true,
    "relationships": [
        {
            "relationshipName": "team",
            "otherEntityName": "team",
            "relationshipType": "many-to-many",
            "otherEntityField": "name",
            "ownerSide": true,
            "otherEntityRelationshipName": "league"
        },
        {
            "relationshipName": "game",
            "otherEntityName": "game",
            "relationshipType": "one-to-many",
            "otherEntityRelationshipName": "league"
        }
    ],
    "fields": [
        {
            "fieldName": "name",
            "fieldType": "String",
            "fieldValidateRules": [
                "required"
            ]
        }
    ],
    "changelogDate": "20180526105947",
    "dto": "no",
    "service": "no",
    "entityTableName": "league",
    "jpaMetamodelFiltering": false,
    "pagination": "no"
}
