{
    "matches": [
        {
            "id": 1,
            "name": "Trening 1",
            "address": "Reja 3",
            "time": "2020-10-29T13:28:00.000Z",
            "totalCost": 150
        },
        {
            "id": 2,
            "name": "Trening 2",
            "address": "Reja 3",
            "time": "2020-11-01T13:28:00.000Z",
            "totalCost": 150
        },
        {
            "id": 3,
            "name": "Trening 3",
            "address": "Reja 3",
            "time": "2020-11-02T13:28:00.000Z",
            "totalCost": 150
        }
    ]
}
