{
  "name": "FasterAssemblingMachines",
  "version": "1.0.0",
  "factorio_version": "0.14",
  "title": "Faster Assembling Machines",
  "author": "Kamikai",
  "contact": "kamikai@gmail.com",
  "homepage": "",
  "description": "Mod that adds 3 new Assembling machines, for faster crafting"
}