{
  "orders4": {
    "config": {
      "cleanup.policy": "delete",
      "retention.ms": "259200000"
    },
    "partitions_count": 6
  },
  "players4": {
    "config": {
      "cleanup.policy": "compact",
      "retention.ms": "604800000"
    },
    "partitions_count": 3
  },
  "clicks4": {
    "config": null,
    "partitions_count": null
  }
}
