EESchema Schematic File Version 4
EELAYER 30 0
EELAYER END
$Descr A4 11693 8268
encoding utf-8
Sheet 1 3
Title "STM32F407VGT6 Template"
Date "2020-06-06"
Rev "0"
Comp "Kamaro-Engineering e.V."
Comment1 ""
Comment2 ""
Comment3 ""
Comment4 ""
$EndDescr
$Comp
L power:+3.3V #PWR0101
U 1 1 5EDCE171
P 10700 750
F 0 "#PWR0101" H 10700 600 50  0001 C CNN
F 1 "+3.3V" H 10715 923 50  0000 C CNN
F 2 "" H 10700 750 50  0001 C CNN
F 3 "" H 10700 750 50  0001 C CNN
	1    10700 750 
	1    0    0    -1  
$EndComp
$Comp
L power:GND #PWR0102
U 1 1 5EDCE7EF
P 10700 1450
F 0 "#PWR0102" H 10700 1200 50  0001 C CNN
F 1 "GND" H 10705 1277 50  0000 C CNN
F 2 "" H 10700 1450 50  0001 C CNN
F 3 "" H 10700 1450 50  0001 C CNN
	1    10700 1450
	1    0    0    -1  
$EndComp
$Comp
L Device:C C8
U 1 1 5EDCFE7F
P 10700 1100
F 0 "C8" H 10815 1146 50  0000 L CNN
F 1 "100n" H 10815 1055 50  0000 L CNN
F 2 "Capacitor_SMD:C_0805_2012Metric_Pad1.15x1.40mm_HandSolder" H 10738 950 50  0001 C CNN
F 3 "~" H 10700 1100 50  0001 C CNN
	1    10700 1100
	1    0    0    -1  
$EndComp
$Comp
L Device:C C7
U 1 1 5EDD046C
P 10250 1100
F 0 "C7" H 10365 1146 50  0000 L CNN
F 1 "100n" H 10365 1055 50  0000 L CNN
F 2 "Capacitor_SMD:C_0805_2012Metric_Pad1.15x1.40mm_HandSolder" H 10288 950 50  0001 C CNN
F 3 "~" H 10250 1100 50  0001 C CNN
	1    10250 1100
	1    0    0    -1  
$EndComp
$Comp
L Device:C C5
U 1 1 5EDD0C72
P 9350 1100
F 0 "C5" H 9465 1146 50  0000 L CNN
F 1 "100n" H 9465 1055 50  0000 L CNN
F 2 "Capacitor_SMD:C_0805_2012Metric_Pad1.15x1.40mm_HandSolder" H 9388 950 50  0001 C CNN
F 3 "~" H 9350 1100 50  0001 C CNN
	1    9350 1100
	1    0    0    -1  
$EndComp
$Comp
L Device:C C4
U 1 1 5EDD1043
P 8900 1100
F 0 "C4" H 9015 1146 50  0000 L CNN
F 1 "100n" H 9015 1055 50  0000 L CNN
F 2 "Capacitor_SMD:C_0805_2012Metric_Pad1.15x1.40mm_HandSolder" H 8938 950 50  0001 C CNN
F 3 "~" H 8900 1100 50  0001 C CNN
	1    8900 1100
	1    0    0    -1  
$EndComp
Wire Wire Line
	8900 1350 8900 1250
Wire Wire Line
	9350 1250 9350 1350
Connection ~ 9350 1350
Wire Wire Line
	9350 1350 8900 1350
Wire Wire Line
	9800 1250 9800 1350
Connection ~ 9800 1350
Wire Wire Line
	9800 1350 9350 1350
Wire Wire Line
	10250 1250 10250 1350
Connection ~ 10250 1350
Wire Wire Line
	10250 1350 9800 1350
Wire Wire Line
	10700 1250 10700 1350
Wire Wire Line
	10700 1350 10250 1350
Wire Wire Line
	8900 850  8900 950 
Wire Wire Line
	9350 950  9350 850 
Connection ~ 9350 850 
Wire Wire Line
	9350 850  8900 850 
Wire Wire Line
	9800 950  9800 850 
Connection ~ 9800 850 
Wire Wire Line
	9800 850  9350 850 
Wire Wire Line
	10250 950  10250 850 
Connection ~ 10250 850 
Wire Wire Line
	10250 850  9800 850 
Wire Wire Line
	10700 950  10700 850 
Wire Wire Line
	10700 850  10250 850 
Text Notes 8900 750  0    50   ~ 0
Place Capacitors near MCU pads
$Comp
L power:+3.3V #PWR0103
U 1 1 5EDD66BE
P 10700 2000
F 0 "#PWR0103" H 10700 1850 50  0001 C CNN
F 1 "+3.3V" H 10715 2173 50  0000 C CNN
F 2 "" H 10700 2000 50  0001 C CNN
F 3 "" H 10700 2000 50  0001 C CNN
	1    10700 2000
	1    0    0    -1  
$EndComp
$Comp
L Device:R R10
U 1 1 5EDD7983
P 9650 2100
F 0 "R10" V 9443 2100 50  0000 C CNN
F 1 "47" V 9534 2100 50  0000 C CNN
F 2 "Resistor_SMD:R_0805_2012Metric_Pad1.15x1.40mm_HandSolder" V 9580 2100 50  0001 C CNN
F 3 "~" H 9650 2100 50  0001 C CNN
	1    9650 2100
	0    1    1    0   
$EndComp
Wire Wire Line
	10700 2000 10700 2100
$Comp
L Device:C C12
U 1 1 5EDD8C0F
P 8750 2400
F 0 "C12" H 8865 2446 50  0000 L CNN
F 1 "100n" H 8865 2355 50  0000 L CNN
F 2 "Capacitor_SMD:C_0805_2012Metric_Pad1.15x1.40mm_HandSolder" H 8788 2250 50  0001 C CNN
F 3 "~" H 8750 2400 50  0001 C CNN
	1    8750 2400
	1    0    0    -1  
$EndComp
$Comp
L Device:C C13
U 1 1 5EDDAA95
P 8750 3000
F 0 "C13" H 8865 3046 50  0000 L CNN
F 1 "100n" H 8865 2955 50  0000 L CNN
F 2 "Capacitor_SMD:C_0805_2012Metric_Pad1.15x1.40mm_HandSolder" H 8788 2850 50  0001 C CNN
F 3 "~" H 8750 3000 50  0001 C CNN
	1    8750 3000
	1    0    0    -1  
$EndComp
Wire Wire Line
	9800 2700 9250 2700
Wire Wire Line
	8750 2700 8750 2550
Wire Wire Line
	8750 2850 8750 2700
Connection ~ 8750 2700
Wire Wire Line
	9250 2850 9250 2700
Connection ~ 9250 2700
Wire Wire Line
	9250 2700 8750 2700
Wire Wire Line
	9250 2700 9250 2550
Wire Wire Line
	9250 2250 9250 2100
Wire Wire Line
	9250 2100 9500 2100
Wire Wire Line
	8750 2250 8750 2100
Wire Wire Line
	8750 2100 9250 2100
Connection ~ 9250 2100
Wire Wire Line
	8750 3150 8750 3300
Wire Wire Line
	8750 3300 9250 3300
Wire Wire Line
	9250 3150 9250 3300
Connection ~ 9250 3300
Text Label 8600 2100 2    50   ~ 0
VREF+
Wire Wire Line
	8750 2100 8600 2100
Connection ~ 8750 2100
$Comp
L Device:L L1
U 1 1 5EDE7837
P 10400 2100
F 0 "L1" V 10590 2100 50  0000 C CNN
F 1 "1u" V 10499 2100 50  0000 C CNN
F 2 "Inductor_SMD:L_1206_3216Metric_Pad1.42x1.75mm_HandSolder" H 10400 2100 50  0001 C CNN
F 3 "~" H 10400 2100 50  0001 C CNN
	1    10400 2100
	0    1    -1   0   
$EndComp
Wire Wire Line
	10550 2100 10700 2100
Wire Wire Line
	9250 3300 10100 3300
Text Label 8600 3300 2    50   ~ 0
VDDA
Wire Wire Line
	9800 2100 10100 2100
Wire Wire Line
	10100 2100 10100 3300
Connection ~ 10100 2100
Wire Wire Line
	10100 2100 10250 2100
Wire Wire Line
	8750 3300 8600 3300
Connection ~ 8750 3300
$Comp
L power:GND #PWR0104
U 1 1 5EDDCFFD
P 9800 2700
F 0 "#PWR0104" H 9800 2450 50  0001 C CNN
F 1 "GND" H 9805 2572 50  0000 R CNN
F 2 "" H 9800 2700 50  0001 C CNN
F 3 "" H 9800 2700 50  0001 C CNN
	1    9800 2700
	1    0    0    -1  
$EndComp
Text Label 8500 3700 2    50   ~ 0
PH0
Text Label 1750 750  1    50   ~ 0
VDD
Wire Wire Line
	1750 850  1850 850 
Wire Wire Line
	1750 750  1750 850 
Connection ~ 1750 850 
Wire Wire Line
	1750 850  1750 1000
Wire Wire Line
	1850 1000 1850 850 
Connection ~ 1850 850 
Wire Wire Line
	1850 850  1950 850 
Wire Wire Line
	1950 1000 1950 850 
Connection ~ 1950 850 
Wire Wire Line
	1950 850  2050 850 
Wire Wire Line
	2050 1000 2050 850 
Connection ~ 2050 850 
Wire Wire Line
	2050 850  2150 850 
Wire Wire Line
	2150 1000 2150 850 
Connection ~ 2150 850 
Wire Wire Line
	2150 850  2250 850 
Wire Wire Line
	2250 1000 2250 850 
Text Label 1650 750  1    50   ~ 0
VBAT
Wire Wire Line
	1650 750  1650 1000
Text Label 1750 6900 2    50   ~ 0
VSS
Wire Wire Line
	1750 6900 1750 6750
Connection ~ 1750 6750
Wire Wire Line
	1750 6750 1750 6500
Wire Wire Line
	1850 6500 1850 6750
Connection ~ 1850 6750
Wire Wire Line
	1850 6750 1750 6750
Wire Wire Line
	1950 6500 1950 6750
Connection ~ 1950 6750
Wire Wire Line
	1950 6750 1850 6750
Wire Wire Line
	2050 6500 2050 6750
Wire Wire Line
	2050 6750 1950 6750
Text Label 850  1300 2    50   ~ 0
NRST
Text Label 850  1500 2    50   ~ 0
BOOT0
Text Label 850  1700 2    50   ~ 0
VCAP_1
Text Label 850  1800 2    50   ~ 0
VCAP_2
Text Label 850  1900 2    50   ~ 0
VREF+
Wire Wire Line
	850  1900 1050 1900
Wire Wire Line
	1050 1800 850  1800
Wire Wire Line
	850  1700 1050 1700
Wire Wire Line
	850  1500 1050 1500
Wire Wire Line
	850  1300 1050 1300
Text Label 3100 3200 0    50   ~ 0
BOOT1
Wire Wire Line
	2850 3200 3100 3200
$Comp
L power:+3.3V #PWR0107
U 1 1 5EF207E7
P 7200 2100
F 0 "#PWR0107" H 7200 1950 50  0001 C CNN
F 1 "+3.3V" V 7215 2228 50  0000 L CNN
F 2 "" H 7200 2100 50  0001 C CNN
F 3 "" H 7200 2100 50  0001 C CNN
	1    7200 2100
	0    -1   -1   0   
$EndComp
$Comp
L Device:R R6
U 1 1 5EF2C123
P 7450 2400
F 0 "R6" V 7243 2400 50  0000 C CNN
F 1 "10k" V 7334 2400 50  0000 C CNN
F 2 "Resistor_SMD:R_0805_2012Metric_Pad1.15x1.40mm_HandSolder" V 7380 2400 50  0001 C CNN
F 3 "~" H 7450 2400 50  0001 C CNN
	1    7450 2400
	0    1    1    0   
$EndComp
Wire Wire Line
	7550 1900 7550 2100
Wire Wire Line
	7200 2100 7250 2100
Wire Wire Line
	7300 2400 7250 2400
Wire Wire Line
	7250 2400 7250 2100
Connection ~ 7250 2100
Wire Wire Line
	7250 2100 7550 2100
Wire Wire Line
	7650 1900 7650 2400
Wire Wire Line
	7650 2400 7600 2400
$Comp
L power:GND #PWR0108
U 1 1 5EF4C4B1
P 7600 2750
F 0 "#PWR0108" H 7600 2500 50  0001 C CNN
F 1 "GND" V 7605 2622 50  0000 R CNN
F 2 "" H 7600 2750 50  0001 C CNN
F 3 "" H 7600 2750 50  0001 C CNN
	1    7600 2750
	0    1    1    0   
$EndComp
$Comp
L Device:R R7
U 1 1 5EF513EF
P 7450 3150
F 0 "R7" V 7243 3150 50  0000 C CNN
F 1 "10k" V 7334 3150 50  0000 C CNN
F 2 "Resistor_SMD:R_0805_2012Metric_Pad1.15x1.40mm_HandSolder" V 7380 3150 50  0001 C CNN
F 3 "~" H 7450 3150 50  0001 C CNN
	1    7450 3150
	0    1    1    0   
$EndComp
Wire Wire Line
	7850 3150 7600 3150
Wire Wire Line
	7250 3150 7300 3150
Connection ~ 7250 2400
Wire Wire Line
	7250 2400 7250 3150
Wire Wire Line
	7850 1900 7850 3150
Text Label 7500 2600 2    50   ~ 0
JTCK
Wire Wire Line
	7650 2400 7650 2600
Wire Wire Line
	7650 2600 7500 2600
Connection ~ 7650 2400
Text Label 7600 3350 2    50   ~ 0
JTMS
Wire Wire Line
	7850 3150 7850 3350
Wire Wire Line
	7850 3350 7600 3350
Connection ~ 7850 3150
Text Label 7600 3500 2    50   ~ 0
NRST
$Comp
L Device:R R8
U 1 1 5EF8D2D0
P 7450 3800
F 0 "R8" V 7243 3800 50  0000 C CNN
F 1 "10k" V 7334 3800 50  0000 C CNN
F 2 "Resistor_SMD:R_0805_2012Metric_Pad1.15x1.40mm_HandSolder" V 7380 3800 50  0001 C CNN
F 3 "~" H 7450 3800 50  0001 C CNN
	1    7450 3800
	0    1    1    0   
$EndComp
Wire Wire Line
	7250 3150 7250 3800
Wire Wire Line
	7250 3800 7300 3800
Connection ~ 7250 3150
Wire Wire Line
	8050 1900 8050 3800
Wire Wire Line
	8050 3800 7600 3800
Text Label 7600 4000 2    50   ~ 0
SPI0_SCK_SWO
Wire Wire Line
	8050 3800 8050 4000
Wire Wire Line
	8050 4000 7600 4000
Connection ~ 8050 3800
Text Label 2900 3300 0    50   ~ 0
SPI0_SCK_SWO
Wire Wire Line
	2900 3300 2850 3300
Text Label 3100 2600 0    50   ~ 0
JTMS
Wire Wire Line
	3100 2600 2850 2600
Text Label 3100 2700 0    50   ~ 0
JTCK
Wire Wire Line
	3100 2700 2850 2700
$Comp
L Interface_CAN_LIN:SN65HVD231 U2
U 1 1 5F000D15
P 3550 7000
F 0 "U2" H 3550 7481 50  0000 C CNN
F 1 "SN65HVD231" H 3550 7390 50  0000 C CNN
F 2 "Package_SO:SOIC-8_3.9x4.9mm_P1.27mm" H 3550 6500 50  0001 C CNN
F 3 "http://www.ti.com/lit/ds/symlink/sn65hvd230.pdf" H 3450 7400 50  0001 C CNN
	1    3550 7000
	1    0    0    -1  
$EndComp
$Comp
L Device:R R9
U 1 1 5F010747
P 3050 7350
F 0 "R9" H 3120 7396 50  0000 L CNN
F 1 "270" H 3120 7305 50  0000 L CNN
F 2 "Resistor_SMD:R_0805_2012Metric_Pad1.15x1.40mm_HandSolder" V 2980 7350 50  0001 C CNN
F 3 "~" H 3050 7350 50  0001 C CNN
	1    3050 7350
	1    0    0    -1  
$EndComp
Wire Wire Line
	3150 7200 3050 7200
$Comp
L power:GND #PWR0109
U 1 1 5F01767E
P 3700 7550
F 0 "#PWR0109" H 3700 7300 50  0001 C CNN
F 1 "GND" V 3705 7422 50  0000 R CNN
F 2 "" H 3700 7550 50  0001 C CNN
F 3 "" H 3700 7550 50  0001 C CNN
	1    3700 7550
	0    -1   -1   0   
$EndComp
Wire Wire Line
	3700 7550 3550 7550
Wire Wire Line
	3550 7400 3550 7550
Connection ~ 3550 7550
Wire Wire Line
	3550 7550 3050 7550
Text Label 3050 6900 2    50   ~ 0
CAN1_TX
Text Label 3050 7000 2    50   ~ 0
CAN1_RX
Wire Wire Line
	3150 7000 3050 7000
Wire Wire Line
	3150 6900 3050 6900
Text Label 4100 7000 1    50   ~ 0
CAN_H
Text Label 4100 7100 3    50   ~ 0
CAN_L
Wire Wire Line
	4100 7100 3950 7100
Wire Wire Line
	4100 7000 3950 7000
Text Label 3100 4300 0    50   ~ 0
CAN1_TX
Text Label 3100 3500 0    50   ~ 0
CAN1_RX
Wire Wire Line
	850  4700 1050 4700
Wire Wire Line
	1050 4800 850  4800
$Comp
L power:+3.3V #PWR0110
U 1 1 5F086159
P 2550 6650
F 0 "#PWR0110" H 2550 6500 50  0001 C CNN
F 1 "+3.3V" H 2565 6823 50  0000 C CNN
F 2 "" H 2550 6650 50  0001 C CNN
F 3 "" H 2550 6650 50  0001 C CNN
	1    2550 6650
	1    0    0    -1  
$EndComp
$Comp
L Device:C C21
U 1 1 5F090696
P 2550 7150
F 0 "C21" H 2665 7196 50  0000 L CNN
F 1 "100n" H 2665 7105 50  0000 L CNN
F 2 "Capacitor_SMD:C_0805_2012Metric_Pad1.15x1.40mm_HandSolder" H 2588 7000 50  0001 C CNN
F 3 "~" H 2550 7150 50  0001 C CNN
	1    2550 7150
	1    0    0    -1  
$EndComp
Wire Wire Line
	3050 7550 3050 7500
Wire Wire Line
	2550 7300 2550 7550
Wire Wire Line
	2550 7550 3050 7550
Connection ~ 3050 7550
Wire Wire Line
	2550 7000 2550 6700
Wire Wire Line
	3550 6700 2550 6700
Connection ~ 2550 6700
Wire Wire Line
	2550 6700 2550 6650
$Comp
L Connector:Conn_01x04_Male J3
U 1 1 5F0B6482
P 1200 6900
F 0 "J3" V 1262 7044 50  0000 L CNN
F 1 "Conn_01x04_Male_XH" V 1353 7044 50  0000 L CNN
F 2 "Connector_JST:JST_XH_B4B-XH-A_1x04_P2.50mm_Vertical" H 1200 6900 50  0001 C CNN
F 3 "~" H 1200 6900 50  0001 C CNN
	1    1200 6900
	0    1    1    0   
$EndComp
$Comp
L power:VCC #PWR0111
U 1 1 5F0B7FA4
P 1350 7200
F 0 "#PWR0111" H 1350 7050 50  0001 C CNN
F 1 "VCC" V 1367 7328 50  0000 L CNN
F 2 "" H 1350 7200 50  0001 C CNN
F 3 "" H 1350 7200 50  0001 C CNN
	1    1350 7200
	0    1    1    0   
$EndComp
Text Label 1350 7350 0    50   ~ 0
CAN_H
Text Label 1350 7500 0    50   ~ 0
CAN_L
$Comp
L power:GND #PWR0112
U 1 1 5F0BC71A
P 1350 7650
F 0 "#PWR0112" H 1350 7400 50  0001 C CNN
F 1 "GND" V 1355 7522 50  0000 R CNN
F 2 "" H 1350 7650 50  0001 C CNN
F 3 "" H 1350 7650 50  0001 C CNN
	1    1350 7650
	0    -1   -1   0   
$EndComp
Wire Wire Line
	1350 7200 1300 7200
Wire Wire Line
	1300 7200 1300 7100
Wire Wire Line
	1350 7350 1200 7350
Wire Wire Line
	1200 7350 1200 7100
Wire Wire Line
	1350 7500 1100 7500
Wire Wire Line
	1100 7500 1100 7100
Wire Wire Line
	1350 7650 1000 7650
Wire Wire Line
	1000 7650 1000 7100
Wire Wire Line
	10950 5450 10950 5650
Wire Wire Line
	10800 5450 10950 5450
Wire Wire Line
	10950 5950 10950 6050
$Comp
L power:GND #PWR0114
U 1 1 5EED75CF
P 10950 6050
F 0 "#PWR0114" H 10950 5800 50  0001 C CNN
F 1 "GND" H 10955 5877 50  0000 C CNN
F 2 "" H 10950 6050 50  0001 C CNN
F 3 "" H 10950 6050 50  0001 C CNN
	1    10950 6050
	1    0    0    -1  
$EndComp
$Comp
L Device:R R5
U 1 1 5EED75C9
P 10950 5800
F 0 "R5" H 11020 5846 50  0000 L CNN
F 1 "510" H 11020 5755 50  0000 L CNN
F 2 "Resistor_SMD:R_0805_2012Metric_Pad1.15x1.40mm_HandSolder" V 10880 5800 50  0001 C CNN
F 3 "~" H 10950 5800 50  0001 C CNN
	1    10950 5800
	1    0    0    -1  
$EndComp
Text Label 10800 5450 2    50   ~ 0
BOOT1
Wire Wire Line
	10250 5450 10100 5450
Wire Wire Line
	10250 5600 10250 5450
Wire Wire Line
	10250 5900 10250 6050
$Comp
L power:GND #PWR0115
U 1 1 5EECE7CB
P 10250 6050
F 0 "#PWR0115" H 10250 5800 50  0001 C CNN
F 1 "GND" H 10255 5877 50  0000 C CNN
F 2 "" H 10250 6050 50  0001 C CNN
F 3 "" H 10250 6050 50  0001 C CNN
	1    10250 6050
	1    0    0    -1  
$EndComp
Text Label 10100 5450 2    50   ~ 0
VCAP_2
Wire Wire Line
	9700 5450 9550 5450
Wire Wire Line
	9700 5600 9700 5450
Wire Wire Line
	9700 5900 9700 6050
$Comp
L power:GND #PWR0116
U 1 1 5EEC6A8A
P 9700 6050
F 0 "#PWR0116" H 9700 5800 50  0001 C CNN
F 1 "GND" H 9705 5877 50  0000 C CNN
F 2 "" H 9700 6050 50  0001 C CNN
F 3 "" H 9700 6050 50  0001 C CNN
	1    9700 6050
	1    0    0    -1  
$EndComp
Text Label 9550 5450 2    50   ~ 0
VCAP_1
Wire Wire Line
	9000 5450 9000 5650
Wire Wire Line
	8850 5450 9000 5450
Wire Wire Line
	9000 5950 9000 6050
$Comp
L power:GND #PWR0118
U 1 1 5EEAB8FB
P 9000 6050
F 0 "#PWR0118" H 9000 5800 50  0001 C CNN
F 1 "GND" H 9005 5877 50  0000 C CNN
F 2 "" H 9000 6050 50  0001 C CNN
F 3 "" H 9000 6050 50  0001 C CNN
	1    9000 6050
	1    0    0    -1  
$EndComp
$Comp
L Device:R R3
U 1 1 5EEAB626
P 9000 5800
F 0 "R3" H 9070 5846 50  0000 L CNN
F 1 "510" H 9070 5755 50  0000 L CNN
F 2 "Resistor_SMD:R_0805_2012Metric_Pad1.15x1.40mm_HandSolder" V 8930 5800 50  0001 C CNN
F 3 "~" H 9000 5800 50  0001 C CNN
	1    9000 5800
	1    0    0    -1  
$EndComp
Text Label 8850 5450 2    50   ~ 0
BOOT0
Wire Wire Line
	8400 5450 8400 5650
Connection ~ 8400 5450
Wire Wire Line
	8250 5450 8400 5450
Wire Wire Line
	8400 5250 8400 5450
Wire Wire Line
	8400 6050 8400 5950
$Comp
L power:GND #PWR0119
U 1 1 5EE9A5DF
P 8400 6050
F 0 "#PWR0119" H 8400 5800 50  0001 C CNN
F 1 "GND" H 8405 5877 50  0000 C CNN
F 2 "" H 8400 6050 50  0001 C CNN
F 3 "" H 8400 6050 50  0001 C CNN
	1    8400 6050
	1    0    0    -1  
$EndComp
$Comp
L power:+3.3V #PWR0120
U 1 1 5EE982EF
P 8400 4850
F 0 "#PWR0120" H 8400 4700 50  0001 C CNN
F 1 "+3.3V" H 8415 5023 50  0000 C CNN
F 2 "" H 8400 4850 50  0001 C CNN
F 3 "" H 8400 4850 50  0001 C CNN
	1    8400 4850
	1    0    0    -1  
$EndComp
$Comp
L Device:C C20
U 1 1 5EE9608F
P 8400 5800
F 0 "C20" H 8515 5846 50  0000 L CNN
F 1 "100n" H 8515 5755 50  0000 L CNN
F 2 "Capacitor_SMD:C_0805_2012Metric_Pad1.15x1.40mm_HandSolder" H 8438 5650 50  0001 C CNN
F 3 "~" H 8400 5800 50  0001 C CNN
	1    8400 5800
	1    0    0    -1  
$EndComp
$Comp
L Device:R R1
U 1 1 5EE95ABF
P 8400 5100
F 0 "R1" H 8470 5146 50  0000 L CNN
F 1 "10k" H 8470 5055 50  0000 L CNN
F 2 "Resistor_SMD:R_0805_2012Metric_Pad1.15x1.40mm_HandSolder" V 8330 5100 50  0001 C CNN
F 3 "~" H 8400 5100 50  0001 C CNN
	1    8400 5100
	1    0    0    -1  
$EndComp
Text Label 8250 5450 2    50   ~ 0
NRST
$Comp
L power:+3.3V #PWR0123
U 1 1 5F1CC9D9
P 7950 800
F 0 "#PWR0123" H 7950 650 50  0001 C CNN
F 1 "+3.3V" H 7965 973 50  0000 C CNN
F 2 "" H 7950 800 50  0001 C CNN
F 3 "" H 7950 800 50  0001 C CNN
	1    7950 800 
	1    0    0    -1  
$EndComp
$Comp
L Connector:Conn_01x02_Male J1
U 1 1 5EEFE37B
P 700 6600
F 0 "J1" V 762 6412 50  0000 R CNN
F 1 "Conn_01x02_Male" V 853 6412 50  0000 R CNN
F 2 "Connector_PinHeader_2.54mm:PinHeader_1x02_P2.54mm_Vertical" H 700 6600 50  0001 C CNN
F 3 "~" H 700 6600 50  0001 C CNN
	1    700  6600
	0    -1   1    0   
$EndComp
$Comp
L power:VCC #PWR0124
U 1 1 5EEFEF3E
P 800 7200
F 0 "#PWR0124" H 800 7050 50  0001 C CNN
F 1 "VCC" H 818 7373 50  0000 C CNN
F 2 "" H 800 7200 50  0001 C CNN
F 3 "" H 800 7200 50  0001 C CNN
	1    800  7200
	-1   0    0    1   
$EndComp
$Comp
L power:GND #PWR0125
U 1 1 5EEFF354
P 700 7000
F 0 "#PWR0125" H 700 6750 50  0001 C CNN
F 1 "GND" H 705 6827 50  0000 C CNN
F 2 "" H 700 7000 50  0001 C CNN
F 3 "" H 700 7000 50  0001 C CNN
	1    700  7000
	1    0    0    -1  
$EndComp
Wire Wire Line
	700  7000 700  6800
Wire Wire Line
	800  6800 800  7200
$Comp
L MCU_ST_STM32F4:STM32F407VGTx U1
U 1 1 5EDBA901
P 1950 3700
F 0 "U1" H 1950 811 50  0000 C CNN
F 1 "STM32F407VGTx" H 1950 720 50  0000 C CNN
F 2 "Package_QFP:LQFP-100_14x14mm_P0.5mm" H 1250 1100 50  0001 R CNN
F 3 "http://www.st.com/st-web-ui/static/active/en/resource/technical/document/datasheet/DM00037051.pdf" H 1950 3700 50  0001 C CNN
	1    1950 3700
	1    0    0    -1  
$EndComp
Text Notes 10200 2200 0    50   ~ 0
L-1206F 1µ
Text Notes 6750 600  0    50   ~ 0
LD 1117 DT33
Text Label 850  2700 2    50   ~ 0
PH0
Text Label 850  2800 2    50   ~ 0
PH1
Wire Wire Line
	1050 2800 850  2800
Wire Wire Line
	850  2700 1050 2700
Wire Wire Line
	7950 1900 7950 3500
Wire Wire Line
	7750 1900 7750 2750
Wire Wire Line
	7600 2750 7750 2750
Wire Wire Line
	7600 3500 7950 3500
Text GLabel 850  3000 0    50   BiDi ~ 0
PE0
Text GLabel 850  3100 0    50   BiDi ~ 0
PE1
Text GLabel 850  3200 0    50   BiDi ~ 0
PE2
Text GLabel 850  3300 0    50   BiDi ~ 0
PE3
Text GLabel 850  3400 0    50   BiDi ~ 0
PE4
Text GLabel 850  3500 0    50   BiDi ~ 0
PE5
Text GLabel 850  3600 0    50   BiDi ~ 0
PE6
Text GLabel 850  3700 0    50   BiDi ~ 0
PE7
Text GLabel 850  3800 0    50   BiDi ~ 0
PE8
Text GLabel 850  3900 0    50   BiDi ~ 0
PE9
Text GLabel 850  4000 0    50   BiDi ~ 0
PE10
Text GLabel 850  4100 0    50   BiDi ~ 0
PE11
Text GLabel 850  4200 0    50   BiDi ~ 0
PE12
Text GLabel 850  4300 0    50   BiDi ~ 0
PE13
Text GLabel 850  4400 0    50   BiDi ~ 0
PE14
Text GLabel 850  4500 0    50   BiDi ~ 0
PE15
Text GLabel 850  4900 0    50   BiDi ~ 0
PD2
Text GLabel 850  5000 0    50   BiDi ~ 0
PD3
Text GLabel 850  5100 0    50   BiDi ~ 0
PD4
Text GLabel 850  5200 0    50   BiDi ~ 0
PD5
Text GLabel 850  5300 0    50   BiDi ~ 0
PD6
Text GLabel 850  5400 0    50   BiDi ~ 0
PD7
Text GLabel 850  5500 0    50   BiDi ~ 0
PD8
Text GLabel 850  5600 0    50   BiDi ~ 0
PD9
Text GLabel 850  5700 0    50   BiDi ~ 0
PD10
Text GLabel 850  5800 0    50   BiDi ~ 0
PD11
Text GLabel 850  5900 0    50   BiDi ~ 0
PD12
Text GLabel 850  6000 0    50   BiDi ~ 0
PD13
Text GLabel 850  6100 0    50   BiDi ~ 0
PD14
Text GLabel 850  6200 0    50   BiDi ~ 0
PD15
Wire Wire Line
	1050 3000 850  3000
Wire Wire Line
	850  3100 1050 3100
Wire Wire Line
	1050 3200 850  3200
Wire Wire Line
	850  3300 1050 3300
Wire Wire Line
	1050 3400 850  3400
Wire Wire Line
	850  3500 1050 3500
Wire Wire Line
	1050 3600 850  3600
Wire Wire Line
	850  3700 1050 3700
Wire Wire Line
	1050 3800 850  3800
Wire Wire Line
	850  3900 1050 3900
Wire Wire Line
	1050 4000 850  4000
Wire Wire Line
	850  4100 1050 4100
Wire Wire Line
	1050 4200 850  4200
Wire Wire Line
	850  4300 1050 4300
Wire Wire Line
	1050 4400 850  4400
Wire Wire Line
	850  4500 1050 4500
Wire Wire Line
	850  4900 1050 4900
Wire Wire Line
	1050 5000 850  5000
Wire Wire Line
	850  5100 1050 5100
Wire Wire Line
	1050 5200 850  5200
Wire Wire Line
	850  5300 1050 5300
Wire Wire Line
	1050 5400 850  5400
Wire Wire Line
	850  5500 1050 5500
Wire Wire Line
	1050 5600 850  5600
Wire Wire Line
	850  5700 1050 5700
Wire Wire Line
	1050 5800 850  5800
Wire Wire Line
	850  5900 1050 5900
Wire Wire Line
	1050 6000 850  6000
Wire Wire Line
	850  6100 1050 6100
Wire Wire Line
	1050 6200 850  6200
Text GLabel 3100 1300 2    50   BiDi ~ 0
PA0
Text GLabel 3100 1400 2    50   BiDi ~ 0
PA1
Text GLabel 3100 1500 2    50   BiDi ~ 0
PA2
Text GLabel 3100 1600 2    50   BiDi ~ 0
PA3
Text GLabel 3100 1700 2    50   BiDi ~ 0
PA4
Text GLabel 3100 1800 2    50   BiDi ~ 0
PA5
Text GLabel 3100 1900 2    50   BiDi ~ 0
PA6
Text GLabel 3100 2000 2    50   BiDi ~ 0
PA7
Text GLabel 3100 2100 2    50   BiDi ~ 0
PA8
Text GLabel 3100 2200 2    50   BiDi ~ 0
PA9
Text GLabel 3100 2300 2    50   BiDi ~ 0
PA10
Text GLabel 3100 2400 2    50   BiDi ~ 0
PA11
Text GLabel 3100 2500 2    50   BiDi ~ 0
PA12
Text GLabel 3100 2800 2    50   BiDi ~ 0
PA15
Wire Wire Line
	2850 1300 3100 1300
Wire Wire Line
	3100 1400 2850 1400
Wire Wire Line
	2850 1500 3100 1500
Wire Wire Line
	3100 1600 2850 1600
Wire Wire Line
	2850 1700 3100 1700
Wire Wire Line
	3100 1800 2850 1800
Wire Wire Line
	2850 1900 3100 1900
Wire Wire Line
	3100 2000 2850 2000
Wire Wire Line
	2850 2100 3100 2100
Wire Wire Line
	3100 2200 2850 2200
Wire Wire Line
	2850 2300 3100 2300
Wire Wire Line
	3100 2400 2850 2400
Wire Wire Line
	2850 2500 3100 2500
Wire Wire Line
	3100 2800 2850 2800
Text GLabel 3100 3000 2    50   BiDi ~ 0
PB0
Wire Wire Line
	3100 3000 2850 3000
Text GLabel 3100 3100 2    50   BiDi ~ 0
PB1
Text GLabel 3100 3600 2    50   BiDi ~ 0
PB6
Text GLabel 3100 3700 2    50   BiDi ~ 0
PB7
Text GLabel 3100 4000 2    50   BiDi ~ 0
PB10
Text GLabel 3100 4100 2    50   BiDi ~ 0
PB11
Text GLabel 3100 4200 2    50   BiDi ~ 0
PB12
Text GLabel 3100 4400 2    50   BiDi ~ 0
PB14
Text GLabel 3100 4500 2    50   BiDi ~ 0
PB15
Text GLabel 3100 3400 2    50   BiDi ~ 0
PB4
Text GLabel 3100 3800 2    50   BiDi ~ 0
PB8
Text GLabel 3100 3900 2    50   BiDi ~ 0
PB9
Text GLabel 3100 4700 2    50   BiDi ~ 0
PC0
Wire Wire Line
	3100 3100 2850 3100
Wire Wire Line
	2850 3400 3100 3400
Wire Wire Line
	3100 3500 2850 3500
Wire Wire Line
	2850 3600 3100 3600
Wire Wire Line
	3100 3700 2850 3700
Wire Wire Line
	2850 3800 3100 3800
Wire Wire Line
	3100 3900 2850 3900
Wire Wire Line
	2850 4000 3100 4000
Wire Wire Line
	3100 4100 2850 4100
Wire Wire Line
	2850 4200 3100 4200
Wire Wire Line
	3100 4300 2850 4300
Wire Wire Line
	2850 4400 3100 4400
Wire Wire Line
	3100 4500 2850 4500
Text GLabel 3100 4800 2    50   BiDi ~ 0
PC1
Text GLabel 3100 4900 2    50   BiDi ~ 0
PC2
Text GLabel 3100 5000 2    50   BiDi ~ 0
PC3
Text GLabel 3100 5100 2    50   BiDi ~ 0
PC4
Text GLabel 3100 5200 2    50   BiDi ~ 0
PC5
Text GLabel 3100 5300 2    50   BiDi ~ 0
PC6
Text GLabel 3100 5400 2    50   BiDi ~ 0
PC7
Text GLabel 3100 5500 2    50   BiDi ~ 0
PC8
Text GLabel 3100 5600 2    50   BiDi ~ 0
PC9
Text GLabel 3100 5700 2    50   BiDi ~ 0
PC10
Text GLabel 3100 5800 2    50   BiDi ~ 0
PC11
Text GLabel 3100 5900 2    50   BiDi ~ 0
PC12
Text GLabel 3100 6000 2    50   BiDi ~ 0
PC13
Text GLabel 3100 6100 2    50   BiDi ~ 0
PC14
Text GLabel 3100 6200 2    50   BiDi ~ 0
PC15
Wire Wire Line
	3100 4700 2850 4700
Wire Wire Line
	2850 4800 3100 4800
Wire Wire Line
	3100 4900 2850 4900
Wire Wire Line
	2850 5000 3100 5000
Wire Wire Line
	3100 5100 2850 5100
Wire Wire Line
	2850 5200 3100 5200
Wire Wire Line
	3100 5300 2850 5300
Wire Wire Line
	2850 5400 3100 5400
Wire Wire Line
	3100 5500 2850 5500
Wire Wire Line
	2850 5600 3100 5600
Wire Wire Line
	3100 5700 2850 5700
Wire Wire Line
	2850 5800 3100 5800
Wire Wire Line
	3100 5900 2850 5900
Wire Wire Line
	3100 6000 2850 6000
Wire Wire Line
	2850 6100 3100 6100
Wire Wire Line
	3100 6200 2850 6200
$Comp
L Device:C C6
U 1 1 5EDD080E
P 9800 1100
F 0 "C6" H 9915 1146 50  0000 L CNN
F 1 "100n" H 9915 1055 50  0000 L CNN
F 2 "Capacitor_SMD:C_0805_2012Metric_Pad1.15x1.40mm_HandSolder" H 9838 950 50  0001 C CNN
F 3 "~" H 9800 1100 50  0001 C CNN
	1    9800 1100
	1    0    0    -1  
$EndComp
$Sheet
S 3700 1850 2400 1500
U 5F240ABD
F0 "connectivity" 50
F1 "connectivity.sch" 50
$EndSheet
$Sheet
S 3700 3600 2400 1450
U 5F242B18
F0 "yourDesign" 50
F1 "yourDesign.sch" 50
$EndSheet
Text Label 5650 7150 2    50   ~ 0
VDD
Text Label 5650 6900 2    50   ~ 0
VBAT
Wire Wire Line
	5650 6900 5650 7000
Text Label 2350 750  1    50   ~ 0
VDDA
Wire Wire Line
	2350 750  2350 1000
$Comp
L Connector:Conn_01x06_Male J2
U 1 1 5EF1A03C
P 7750 1700
F 0 "J2" V 7812 1312 50  0000 R CNN
F 1 "Conn_01x06_Male" V 7903 1312 50  0000 R CNN
F 2 "Connector_PinHeader_2.54mm:PinHeader_1x06_P2.54mm_Vertical" H 7750 1700 50  0001 C CNN
F 3 "~" H 7750 1700 50  0001 C CNN
	1    7750 1700
	0    -1   1    0   
$EndComp
$Comp
L Kamaro_Parts:MIX-D-SUB-7W2 J4
U 1 1 5F244C15
P 7150 5550
F 0 "J4" V 6485 5562 50  0000 C CNN
F 1 "MIX-D-SUB-7W2" V 6576 5562 50  0000 C CNN
F 2 "Kamaro_Footprints:MIX-D-SUB-7W2" H 7150 5850 50  0001 C CNN
F 3 "" H 7850 5600 50  0001 C CNN
	1    7150 5550
	0    1    1    0   
$EndComp
Wire Wire Line
	7300 5200 7550 5200
$Comp
L power:+BATT #PWR0113
U 1 1 5F26DC9D
P 7550 5200
F 0 "#PWR0113" H 7550 5050 50  0001 C CNN
F 1 "+BATT" V 7565 5328 50  0000 L CNN
F 2 "" H 7550 5200 50  0001 C CNN
F 3 "" H 7550 5200 50  0001 C CNN
	1    7550 5200
	0    1    1    0   
$EndComp
Wire Wire Line
	7300 5900 7550 5900
$Comp
L power:-BATT #PWR0117
U 1 1 5F2835FE
P 7550 5900
F 0 "#PWR0117" H 7550 5750 50  0001 C CNN
F 1 "-BATT" V 7565 6028 50  0000 L CNN
F 2 "" H 7550 5900 50  0001 C CNN
F 3 "" H 7550 5900 50  0001 C CNN
	1    7550 5900
	0    1    1    0   
$EndComp
Wire Wire Line
	7200 5750 7450 5750
Wire Wire Line
	7450 5750 7450 5650
Wire Wire Line
	7300 5650 7450 5650
Wire Wire Line
	7450 5650 7650 5650
Wire Wire Line
	7650 5650 7650 5700
Connection ~ 7450 5650
$Comp
L power:GND #PWR0121
U 1 1 5F2C3C09
P 7650 5700
F 0 "#PWR0121" H 7650 5450 50  0001 C CNN
F 1 "GND" H 7655 5527 50  0000 C CNN
F 2 "" H 7650 5700 50  0001 C CNN
F 3 "" H 7650 5700 50  0001 C CNN
	1    7650 5700
	1    0    0    -1  
$EndComp
Wire Wire Line
	7200 5350 7550 5350
$Comp
L power:VCC #PWR0122
U 1 1 5F2D9FD7
P 7550 5350
F 0 "#PWR0122" H 7550 5200 50  0001 C CNN
F 1 "VCC" V 7565 5478 50  0000 L CNN
F 2 "" H 7550 5350 50  0001 C CNN
F 3 "" H 7550 5350 50  0001 C CNN
	1    7550 5350
	0    1    1    0   
$EndComp
Text Label 7450 5450 0    50   ~ 0
CAN_H
Text Label 7450 5550 0    50   ~ 0
CAN_L
Wire Wire Line
	7450 5450 7300 5450
Wire Wire Line
	7200 5550 7450 5550
$Comp
L Regulator_Switching:TSR_1-2450 U3
U 1 1 5F332739
P 5550 1000
F 0 "U3" H 5550 1367 50  0000 C CNN
F 1 "TSR_1-2450" H 5550 1276 50  0000 C CNN
F 2 "Converter_DCDC:Converter_DCDC_TRACO_TSR-1_THT" H 5550 850 50  0001 L CIN
F 3 "http://www.tracopower.com/products/tsr1.pdf" H 5550 1000 50  0001 C CNN
	1    5550 1000
	1    0    0    -1  
$EndComp
$Comp
L power:VCC #PWR0126
U 1 1 5F33DEC2
P 4550 800
F 0 "#PWR0126" H 4550 650 50  0001 C CNN
F 1 "VCC" H 4565 973 50  0000 C CNN
F 2 "" H 4550 800 50  0001 C CNN
F 3 "" H 4550 800 50  0001 C CNN
	1    4550 800 
	1    0    0    -1  
$EndComp
Wire Wire Line
	5150 900  4950 900 
Wire Wire Line
	4550 900  4550 800 
$Comp
L Device:C C1
U 1 1 5F356974
P 4550 1100
F 0 "C1" H 4665 1146 50  0000 L CNN
F 1 "100n" H 4665 1055 50  0000 L CNN
F 2 "Capacitor_SMD:C_0805_2012Metric_Pad1.15x1.40mm_HandSolder" H 4588 950 50  0001 C CNN
F 3 "~" H 4550 1100 50  0001 C CNN
	1    4550 1100
	1    0    0    -1  
$EndComp
$Comp
L Device:CP C2
U 1 1 5F357192
P 4950 1100
F 0 "C2" H 5068 1146 50  0000 L CNN
F 1 "10u" H 5068 1055 50  0000 L CNN
F 2 "Capacitor_THT:CP_Radial_D6.3mm_P2.50mm" H 4988 950 50  0001 C CNN
F 3 "~" H 4950 1100 50  0001 C CNN
	1    4950 1100
	1    0    0    -1  
$EndComp
$Comp
L power:GND #PWR0127
U 1 1 5F35869B
P 4550 1350
F 0 "#PWR0127" H 4550 1100 50  0001 C CNN
F 1 "GND" H 4555 1177 50  0000 C CNN
F 2 "" H 4550 1350 50  0001 C CNN
F 3 "" H 4550 1350 50  0001 C CNN
	1    4550 1350
	1    0    0    -1  
$EndComp
Wire Wire Line
	4550 950  4550 900 
Connection ~ 4550 900 
Wire Wire Line
	4950 950  4950 900 
Connection ~ 4950 900 
Wire Wire Line
	4950 900  4550 900 
Wire Wire Line
	4550 1250 4550 1300
Wire Wire Line
	4550 1300 4950 1300
Wire Wire Line
	4950 1300 4950 1250
Connection ~ 4550 1300
Wire Wire Line
	4550 1300 4550 1350
Wire Wire Line
	4950 1300 5550 1300
Wire Wire Line
	5550 1300 5550 1200
Connection ~ 4950 1300
$Comp
L Device:CP C9
U 1 1 5F3FB969
P 6050 1100
F 0 "C9" H 6168 1146 50  0000 L CNN
F 1 "10u" H 6168 1055 50  0000 L CNN
F 2 "Capacitor_THT:CP_Radial_D6.3mm_P2.50mm" H 6088 950 50  0001 C CNN
F 3 "~" H 6050 1100 50  0001 C CNN
	1    6050 1100
	1    0    0    -1  
$EndComp
$Comp
L Device:C C10
U 1 1 5F3FC219
P 6450 1100
F 0 "C10" H 6565 1146 50  0000 L CNN
F 1 "100n" H 6565 1055 50  0000 L CNN
F 2 "Capacitor_SMD:C_0805_2012Metric_Pad1.15x1.40mm_HandSolder" H 6488 950 50  0001 C CNN
F 3 "~" H 6450 1100 50  0001 C CNN
	1    6450 1100
	1    0    0    -1  
$EndComp
Wire Wire Line
	5950 900  6050 900 
Wire Wire Line
	6050 900  6050 950 
Wire Wire Line
	5550 1300 6050 1300
Wire Wire Line
	6050 1300 6050 1250
Connection ~ 5550 1300
Wire Wire Line
	6050 1300 6450 1300
Wire Wire Line
	6450 1300 6450 1250
Connection ~ 6050 1300
Wire Wire Line
	6050 900  6450 900 
Wire Wire Line
	6450 900  6450 950 
Connection ~ 6050 900 
$Comp
L power:+5V #PWR0128
U 1 1 5F45E676
P 6050 800
F 0 "#PWR0128" H 6050 650 50  0001 C CNN
F 1 "+5V" H 6065 973 50  0000 C CNN
F 2 "" H 6050 800 50  0001 C CNN
F 3 "" H 6050 800 50  0001 C CNN
	1    6050 800 
	1    0    0    -1  
$EndComp
Wire Wire Line
	6050 900  6050 800 
$Comp
L Regulator_Linear:NCP1117-3.3_TO252 U4
U 1 1 5F4799AC
P 7100 900
F 0 "U4" H 7100 1142 50  0000 C CNN
F 1 "NCP1117-3.3_TO252" H 7100 1051 50  0000 C CNN
F 2 "Package_TO_SOT_SMD:TO-252-2" H 7100 1125 50  0001 C CNN
F 3 "http://www.onsemi.com/pub_link/Collateral/NCP1117-D.PDF" H 7100 900 50  0001 C CNN
	1    7100 900 
	1    0    0    -1  
$EndComp
$Comp
L Device:CP C11
U 1 1 5F4B6C9B
P 7550 1100
F 0 "C11" H 7668 1146 50  0000 L CNN
F 1 "10u" H 7668 1055 50  0000 L CNN
F 2 "Capacitor_THT:CP_Radial_D6.3mm_P2.50mm" H 7588 950 50  0001 C CNN
F 3 "~" H 7550 1100 50  0001 C CNN
	1    7550 1100
	1    0    0    -1  
$EndComp
$Comp
L Device:C C22
U 1 1 5F4B7475
P 7950 1100
F 0 "C22" H 8065 1146 50  0000 L CNN
F 1 "100n" H 8065 1055 50  0000 L CNN
F 2 "Capacitor_SMD:C_0805_2012Metric_Pad1.15x1.40mm_HandSolder" H 7988 950 50  0001 C CNN
F 3 "~" H 7950 1100 50  0001 C CNN
	1    7950 1100
	1    0    0    -1  
$EndComp
Wire Wire Line
	7950 950  7950 900 
Wire Wire Line
	7400 900  7550 900 
Connection ~ 7950 900 
Wire Wire Line
	7950 900  7950 800 
Wire Wire Line
	7550 950  7550 900 
Connection ~ 7550 900 
Wire Wire Line
	7550 900  7950 900 
Wire Wire Line
	6800 900  6450 900 
Connection ~ 6450 900 
Wire Wire Line
	6450 1300 7100 1300
Wire Wire Line
	7100 1300 7100 1200
Connection ~ 6450 1300
Wire Wire Line
	7100 1300 7550 1300
Wire Wire Line
	7550 1300 7550 1250
Connection ~ 7100 1300
Wire Wire Line
	7550 1300 7950 1300
Wire Wire Line
	7950 1300 7950 1250
Connection ~ 7550 1300
$Comp
L Device:C C14
U 1 1 5F5BE00D
P 9250 2400
F 0 "C14" H 9365 2446 50  0000 L CNN
F 1 "2u2" H 9365 2355 50  0000 L CNN
F 2 "Capacitor_SMD:C_1206_3216Metric_Pad1.42x1.75mm_HandSolder" H 9288 2250 50  0001 C CNN
F 3 "~" H 9250 2400 50  0001 C CNN
	1    9250 2400
	1    0    0    -1  
$EndComp
$Comp
L Device:C C15
U 1 1 5F5BE3FF
P 9250 3000
F 0 "C15" H 9365 3046 50  0000 L CNN
F 1 "2u2" H 9365 2955 50  0000 L CNN
F 2 "Capacitor_SMD:C_1206_3216Metric_Pad1.42x1.75mm_HandSolder" H 9288 2850 50  0001 C CNN
F 3 "~" H 9250 3000 50  0001 C CNN
	1    9250 3000
	1    0    0    -1  
$EndComp
Wire Wire Line
	10700 750  10700 850 
Connection ~ 10700 850 
Wire Wire Line
	10700 1350 10700 1450
Connection ~ 10700 1350
$Comp
L Device:R R2
U 1 1 5F72BD74
P 9000 5100
F 0 "R2" H 9070 5146 50  0000 L CNN
F 1 "DNP" H 9070 5055 50  0000 L CNN
F 2 "Resistor_SMD:R_0805_2012Metric_Pad1.15x1.40mm_HandSolder" V 8930 5100 50  0001 C CNN
F 3 "~" H 9000 5100 50  0001 C CNN
	1    9000 5100
	1    0    0    -1  
$EndComp
$Comp
L Device:R R4
U 1 1 5F72C160
P 10950 5100
F 0 "R4" H 11020 5146 50  0000 L CNN
F 1 "DNP" H 11020 5055 50  0000 L CNN
F 2 "Resistor_SMD:R_0805_2012Metric_Pad1.15x1.40mm_HandSolder" V 10880 5100 50  0001 C CNN
F 3 "~" H 10950 5100 50  0001 C CNN
	1    10950 5100
	1    0    0    -1  
$EndComp
$Comp
L power:+3.3V #PWR0129
U 1 1 5F72C7F7
P 9000 4850
F 0 "#PWR0129" H 9000 4700 50  0001 C CNN
F 1 "+3.3V" H 9015 5023 50  0000 C CNN
F 2 "" H 9000 4850 50  0001 C CNN
F 3 "" H 9000 4850 50  0001 C CNN
	1    9000 4850
	1    0    0    -1  
$EndComp
$Comp
L power:+3.3V #PWR0130
U 1 1 5F72D10D
P 10950 4850
F 0 "#PWR0130" H 10950 4700 50  0001 C CNN
F 1 "+3.3V" H 10965 5023 50  0000 C CNN
F 2 "" H 10950 4850 50  0001 C CNN
F 3 "" H 10950 4850 50  0001 C CNN
	1    10950 4850
	1    0    0    -1  
$EndComp
Wire Wire Line
	8400 4950 8400 4850
Wire Wire Line
	9000 4950 9000 4850
Wire Wire Line
	10950 4950 10950 4850
Wire Wire Line
	10950 5250 10950 5450
Connection ~ 10950 5450
Wire Wire Line
	9000 5250 9000 5450
Connection ~ 9000 5450
Text Notes 8350 6400 0    50   ~ 0
DNP = DO NOT POPULATE = NICHT BESTUECKEN
$Comp
L Device:C C16
U 1 1 5F7A9323
P 9700 5750
F 0 "C16" H 9815 5796 50  0000 L CNN
F 1 "2u2" H 9815 5705 50  0000 L CNN
F 2 "Capacitor_SMD:C_1206_3216Metric_Pad1.42x1.75mm_HandSolder" H 9738 5600 50  0001 C CNN
F 3 "~" H 9700 5750 50  0001 C CNN
	1    9700 5750
	1    0    0    -1  
$EndComp
$Comp
L Device:C C17
U 1 1 5F7A9D1A
P 10250 5750
F 0 "C17" H 10365 5796 50  0000 L CNN
F 1 "2u2" H 10365 5705 50  0000 L CNN
F 2 "Capacitor_SMD:C_1206_3216Metric_Pad1.42x1.75mm_HandSolder" H 10288 5600 50  0001 C CNN
F 3 "~" H 10250 5750 50  0001 C CNN
	1    10250 5750
	1    0    0    -1  
$EndComp
Wire Wire Line
	5850 7000 5650 7000
Connection ~ 5650 7000
Wire Wire Line
	5650 7000 5650 7150
$Comp
L power:+3.3V #PWR0131
U 1 1 5F28C885
P 5850 7000
F 0 "#PWR0131" H 5850 6850 50  0001 C CNN
F 1 "+3.3V" H 5865 7173 50  0000 C CNN
F 2 "" H 5850 7000 50  0001 C CNN
F 3 "" H 5850 7000 50  0001 C CNN
	1    5850 7000
	1    0    0    -1  
$EndComp
Wire Wire Line
	2150 6500 2150 6900
Text Label 2150 6900 2    50   ~ 0
VSSA
Text Notes 8850 3900 0    50   ~ 0
16,0000-HC49-SMD
Connection ~ 9750 3700
Wire Wire Line
	9750 3700 10000 3700
Connection ~ 8700 3700
Wire Wire Line
	8700 3700 8500 3700
Text Label 10000 3700 0    50   ~ 0
PH1
Wire Wire Line
	9750 3700 9750 3850
Wire Wire Line
	9400 3700 9750 3700
Wire Wire Line
	8700 3700 9100 3700
Wire Wire Line
	8700 3850 8700 3700
Wire Wire Line
	8700 4250 8700 4150
Wire Wire Line
	9750 4250 9750 4150
$Comp
L power:GND #PWR0106
U 1 1 5EE0184F
P 9750 4250
F 0 "#PWR0106" H 9750 4000 50  0001 C CNN
F 1 "GND" H 9755 4077 50  0000 C CNN
F 2 "" H 9750 4250 50  0001 C CNN
F 3 "" H 9750 4250 50  0001 C CNN
	1    9750 4250
	1    0    0    -1  
$EndComp
$Comp
L power:GND #PWR0105
U 1 1 5EE01629
P 8700 4250
F 0 "#PWR0105" H 8700 4000 50  0001 C CNN
F 1 "GND" H 8705 4077 50  0000 C CNN
F 2 "" H 8700 4250 50  0001 C CNN
F 3 "" H 8700 4250 50  0001 C CNN
	1    8700 4250
	1    0    0    -1  
$EndComp
$Comp
L Device:C C19
U 1 1 5EE01099
P 9750 4000
F 0 "C19" H 9865 4046 50  0000 L CNN
F 1 "22p" H 9865 3955 50  0000 L CNN
F 2 "Capacitor_SMD:C_0805_2012Metric_Pad1.15x1.40mm_HandSolder" H 9788 3850 50  0001 C CNN
F 3 "~" H 9750 4000 50  0001 C CNN
	1    9750 4000
	1    0    0    -1  
$EndComp
$Comp
L Device:C C18
U 1 1 5EE00D1F
P 8700 4000
F 0 "C18" H 8815 4046 50  0000 L CNN
F 1 "22p" H 8815 3955 50  0000 L CNN
F 2 "Capacitor_SMD:C_0805_2012Metric_Pad1.15x1.40mm_HandSolder" H 8738 3850 50  0001 C CNN
F 3 "~" H 8700 4000 50  0001 C CNN
	1    8700 4000
	1    0    0    -1  
$EndComp
$Comp
L Device:Crystal X1
U 1 1 5EE00762
P 9250 3700
F 0 "X1" H 9250 3968 50  0000 C CNN
F 1 "16MHz" H 9250 3877 50  0000 C CNN
F 2 "Crystal:Crystal_SMD_HC49-SD" H 9250 3700 50  0001 C CNN
F 3 "~" H 9250 3700 50  0001 C CNN
	1    9250 3700
	1    0    0    -1  
$EndComp
Text Label 10650 3750 2    50   ~ 0
VSS
Wire Wire Line
	10650 3750 10650 3600
Text Label 11050 3750 2    50   ~ 0
VSSA
Wire Wire Line
	11050 3750 11050 3600
Wire Wire Line
	11050 3600 10650 3600
$Comp
L power:GND #PWR0132
U 1 1 5F5846D3
P 10300 4250
F 0 "#PWR0132" H 10300 4000 50  0001 C CNN
F 1 "GND" H 10305 4077 50  0000 C CNN
F 2 "" H 10300 4250 50  0001 C CNN
F 3 "" H 10300 4250 50  0001 C CNN
	1    10300 4250
	1    0    0    -1  
$EndComp
$Comp
L Jumper:Jumper_2_Bridged JP1
U 1 1 5F5BA872
P 10300 3900
F 0 "JP1" V 10254 3958 50  0000 L CNN
F 1 "Jumper_2_Bridged" V 10345 3958 50  0000 L CNN
F 2 "Jumper:SolderJumper-2_P1.3mm_Bridged_RoundedPad1.0x1.5mm" H 10300 3900 50  0001 C CNN
F 3 "~" H 10300 3900 50  0001 C CNN
	1    10300 3900
	0    1    1    0   
$EndComp
Wire Wire Line
	10300 4250 10300 4100
Wire Wire Line
	10300 3700 10300 3600
Wire Wire Line
	10300 3600 10650 3600
Connection ~ 10650 3600
Text Label 4950 7050 0    50   ~ 0
CAN_H
Text Label 4950 7250 0    50   ~ 0
CAN_L
Text GLabel 4550 7050 0    50   Input ~ 0
CAN_H
Text GLabel 4550 7250 0    50   Input ~ 0
CAN_L
Wire Wire Line
	4550 7050 4950 7050
Wire Wire Line
	4950 7250 4550 7250
Text Label 4950 6850 0    50   ~ 0
VCC
Text GLabel 4550 6850 0    50   Input ~ 0
VCC
Wire Wire Line
	4950 6850 4550 6850
Text GLabel 850  4700 0    50   BiDi ~ 0
PD0
Text GLabel 850  4800 0    50   BiDi ~ 0
PD1
$EndSCHEMATC
