EESchema Schematic File Version 4
EELAYER 30 0
EELAYER END
$Descr A4 11693 8268
encoding utf-8
Sheet 2 3
Title ""
Date ""
Rev ""
Comp ""
Comment1 ""
Comment2 ""
Comment3 ""
Comment4 ""
$EndDescr
$Comp
L Connector:USB_B_Mini J8
U 1 1 5F471700
P 5950 1950
F 0 "J8" H 6007 2417 50  0000 C CNN
F 1 "USB_B_Mini" H 6007 2326 50  0000 C CNN
F 2 "Connector_USB:USB_Mini-B_Lumberg_2486_01_Horizontal" H 6100 1900 50  0001 C CNN
F 3 "~" H 6100 1900 50  0001 C CNN
	1    5950 1950
	1    0    0    -1  
$EndComp
$Comp
L Interface_USB:FT232RL U5
U 1 1 5F4734D5
P 7800 2350
F 0 "U5" H 7800 3531 50  0000 C CNN
F 1 "FT232RL" H 7800 3440 50  0000 C CNN
F 2 "Package_SO:SSOP-28_5.3x10.2mm_P0.65mm" H 8900 1450 50  0001 C CNN
F 3 "https://www.ftdichip.com/Support/Documents/DataSheets/ICs/DS_FT232R.pdf" H 7800 2350 50  0001 C CNN
	1    7800 2350
	1    0    0    -1  
$EndComp
NoConn ~ 5850 2350
Wire Wire Line
	7000 1950 6250 1950
Wire Wire Line
	6250 2050 7000 2050
Wire Wire Line
	7000 1650 6950 1650
Wire Wire Line
	6950 1650 6950 1300
Wire Wire Line
	6950 1300 7700 1300
Wire Wire Line
	7700 1300 7700 1350
$Comp
L Device:C C23
U 1 1 5F50B8D7
P 6700 1650
F 0 "C23" V 6448 1650 50  0000 C CNN
F 1 "100n" V 6539 1650 50  0000 C CNN
F 2 "Capacitor_SMD:C_0805_2012Metric_Pad1.18x1.45mm_HandSolder" H 6738 1500 50  0001 C CNN
F 3 "~" H 6700 1650 50  0001 C CNN
	1    6700 1650
	0    1    1    0   
$EndComp
Wire Wire Line
	6950 1650 6850 1650
Connection ~ 6950 1650
$Comp
L power:GND #PWR0136
U 1 1 5F50C26D
P 6550 1750
F 0 "#PWR0136" H 6550 1500 50  0001 C CNN
F 1 "GND" H 6555 1577 50  0000 C CNN
F 2 "" H 6550 1750 50  0001 C CNN
F 3 "" H 6550 1750 50  0001 C CNN
	1    6550 1750
	1    0    0    -1  
$EndComp
Wire Wire Line
	6550 1750 6550 1650
$Comp
L Device:C C3
U 1 1 5F50C8CD
P 6400 2450
F 0 "C3" H 6515 2496 50  0000 L CNN
F 1 "100n" H 6515 2405 50  0000 L CNN
F 2 "Capacitor_SMD:C_0805_2012Metric_Pad1.18x1.45mm_HandSolder" H 6438 2300 50  0001 C CNN
F 3 "~" H 6400 2450 50  0001 C CNN
	1    6400 2450
	1    0    0    -1  
$EndComp
Wire Wire Line
	6400 2300 6400 2150
Wire Wire Line
	6400 2150 6250 2150
$Comp
L power:GND #PWR0137
U 1 1 5F50D16C
P 6400 2750
F 0 "#PWR0137" H 6400 2500 50  0001 C CNN
F 1 "GND" H 6405 2577 50  0000 C CNN
F 2 "" H 6400 2750 50  0001 C CNN
F 3 "" H 6400 2750 50  0001 C CNN
	1    6400 2750
	1    0    0    -1  
$EndComp
Wire Wire Line
	6400 2600 6400 2700
Wire Wire Line
	6400 2700 5950 2700
Connection ~ 6400 2700
Wire Wire Line
	6400 2700 6400 2750
Wire Wire Line
	5950 2350 5950 2700
$Comp
L power:GND #PWR0138
U 1 1 5F50E0AB
P 7600 3600
F 0 "#PWR0138" H 7600 3350 50  0001 C CNN
F 1 "GND" H 7605 3427 50  0000 C CNN
F 2 "" H 7600 3600 50  0001 C CNN
F 3 "" H 7600 3600 50  0001 C CNN
	1    7600 3600
	1    0    0    -1  
$EndComp
Wire Wire Line
	7600 3600 7600 3500
Wire Wire Line
	7600 3500 7800 3500
Wire Wire Line
	8000 3500 8000 3350
Connection ~ 7600 3500
Wire Wire Line
	7600 3500 7600 3350
Wire Wire Line
	7900 3350 7900 3500
Connection ~ 7900 3500
Wire Wire Line
	7900 3500 8000 3500
Wire Wire Line
	7800 3350 7800 3500
Connection ~ 7800 3500
Wire Wire Line
	7800 3500 7900 3500
Wire Wire Line
	6950 3050 7000 3050
$Comp
L Device:R R11
U 1 1 5F510249
P 6700 2350
F 0 "R11" V 6493 2350 50  0000 C CNN
F 1 "4k7" V 6584 2350 50  0000 C CNN
F 2 "Resistor_SMD:R_0805_2012Metric_Pad1.20x1.40mm_HandSolder" V 6630 2350 50  0001 C CNN
F 3 "~" H 6700 2350 50  0001 C CNN
	1    6700 2350
	0    1    1    0   
$EndComp
NoConn ~ 7000 2550
NoConn ~ 7000 2750
Wire Wire Line
	7000 2350 6900 2350
Wire Wire Line
	6550 2350 6450 2350
Wire Wire Line
	6450 2350 6450 1750
Wire Wire Line
	6450 1750 6250 1750
$Comp
L Device:R R12
U 1 1 5F513573
P 6700 2900
F 0 "R12" H 6630 2854 50  0000 R CNN
F 1 "10k" H 6630 2945 50  0000 R CNN
F 2 "Resistor_SMD:R_0805_2012Metric_Pad1.20x1.40mm_HandSolder" V 6630 2900 50  0001 C CNN
F 3 "~" H 6700 2900 50  0001 C CNN
	1    6700 2900
	-1   0    0    1   
$EndComp
Wire Wire Line
	6900 2350 6900 2600
Wire Wire Line
	6900 2600 6700 2600
Wire Wire Line
	6700 2600 6700 2750
Connection ~ 6900 2350
Wire Wire Line
	6900 2350 6850 2350
Wire Wire Line
	6700 3050 6700 3500
Text GLabel 9250 1550 2    50   Input ~ 0
PA10
Text GLabel 9250 1850 2    50   Input ~ 0
PA9
$Comp
L Device:R R13
U 1 1 5F51A294
P 8950 1550
F 0 "R13" V 8743 1550 50  0000 C CNN
F 1 "1k" V 8834 1550 50  0000 C CNN
F 2 "Resistor_SMD:R_0805_2012Metric_Pad1.20x1.40mm_HandSolder" V 8880 1550 50  0001 C CNN
F 3 "~" H 8950 1550 50  0001 C CNN
	1    8950 1550
	0    1    1    0   
$EndComp
$Comp
L Device:R R14
U 1 1 5F51A7F5
P 8950 1850
F 0 "R14" V 9157 1850 50  0000 C CNN
F 1 "1k" V 9066 1850 50  0000 C CNN
F 2 "Resistor_SMD:R_0805_2012Metric_Pad1.20x1.40mm_HandSolder" V 8880 1850 50  0001 C CNN
F 3 "~" H 8950 1850 50  0001 C CNN
	1    8950 1850
	0    -1   -1   0   
$EndComp
Wire Wire Line
	9250 1550 9100 1550
Wire Wire Line
	9100 1850 9250 1850
$Comp
L Device:LED D1
U 1 1 5F51DFFA
P 9100 2500
F 0 "D1" H 9093 2717 50  0000 C CNN
F 1 "LED_RED" H 9093 2626 50  0000 C CNN
F 2 "LED_SMD:LED_0805_2012Metric_Castellated" H 9100 2500 50  0001 C CNN
F 3 "~" H 9100 2500 50  0001 C CNN
	1    9100 2500
	1    0    0    -1  
$EndComp
$Comp
L Device:LED D2
U 1 1 5F51ED88
P 9100 2850
F 0 "D2" H 9093 3067 50  0000 C CNN
F 1 "LED_GRE" H 9093 2976 50  0000 C CNN
F 2 "LED_SMD:LED_0805_2012Metric_Castellated" H 9100 2850 50  0001 C CNN
F 3 "~" H 9100 2850 50  0001 C CNN
	1    9100 2850
	1    0    0    -1  
$EndComp
$Comp
L Device:R R15
U 1 1 5F51F23C
P 9600 2500
F 0 "R15" V 9393 2500 50  0000 C CNN
F 1 "270" V 9484 2500 50  0000 C CNN
F 2 "Resistor_SMD:R_0805_2012Metric_Pad1.20x1.40mm_HandSolder" V 9530 2500 50  0001 C CNN
F 3 "~" H 9600 2500 50  0001 C CNN
	1    9600 2500
	0    1    1    0   
$EndComp
$Comp
L Device:R R16
U 1 1 5F51F660
P 9600 2850
F 0 "R16" V 9393 2850 50  0000 C CNN
F 1 "270" V 9484 2850 50  0000 C CNN
F 2 "Resistor_SMD:R_0805_2012Metric_Pad1.20x1.40mm_HandSolder" V 9530 2850 50  0001 C CNN
F 3 "~" H 9600 2850 50  0001 C CNN
	1    9600 2850
	0    1    1    0   
$EndComp
$Comp
L power:+3.3V #PWR0139
U 1 1 5F51FB3D
P 10100 2300
F 0 "#PWR0139" H 10100 2150 50  0001 C CNN
F 1 "+3.3V" H 10115 2473 50  0000 C CNN
F 2 "" H 10100 2300 50  0001 C CNN
F 3 "" H 10100 2300 50  0001 C CNN
	1    10100 2300
	1    0    0    -1  
$EndComp
Wire Wire Line
	10100 2300 10100 2500
Wire Wire Line
	10100 2850 9750 2850
Wire Wire Line
	9750 2500 10100 2500
Connection ~ 10100 2500
Wire Wire Line
	10100 2500 10100 2850
Wire Wire Line
	9450 2500 9250 2500
Wire Wire Line
	9450 2850 9250 2850
Wire Wire Line
	8950 2850 8800 2850
Wire Wire Line
	8800 2850 8800 2750
Wire Wire Line
	8800 2750 8600 2750
Wire Wire Line
	8600 2650 8800 2650
Wire Wire Line
	8800 2650 8800 2500
Wire Wire Line
	8800 2500 8950 2500
NoConn ~ 8600 1850
NoConn ~ 8600 1950
NoConn ~ 8600 2050
NoConn ~ 8600 2150
NoConn ~ 8600 2250
NoConn ~ 8600 2350
NoConn ~ 8600 2850
NoConn ~ 8600 2950
NoConn ~ 8600 3050
Wire Wire Line
	8800 1550 8750 1550
Wire Wire Line
	8750 1550 8750 1650
Wire Wire Line
	8750 1650 8600 1650
Wire Wire Line
	8800 1850 8750 1850
Wire Wire Line
	8750 1850 8750 1750
Wire Wire Line
	8750 1750 8600 1750
$Comp
L power:+5V #PWR0133
U 1 1 5F5B9593
P 7900 1150
F 0 "#PWR0133" H 7900 1000 50  0001 C CNN
F 1 "+5V" H 7915 1323 50  0000 C CNN
F 2 "" H 7900 1150 50  0001 C CNN
F 3 "" H 7900 1150 50  0001 C CNN
	1    7900 1150
	1    0    0    -1  
$EndComp
Wire Wire Line
	6700 3500 6950 3500
$Comp
L Jumper:SolderJumper_2_Bridged JP2
U 1 1 5F5BA73C
P 6950 3250
F 0 "JP2" V 6996 3162 50  0000 R CNN
F 1 "SolderJumper_2_Bridged" V 6905 3162 50  0000 R CNN
F 2 "Jumper:SolderJumper-2_P1.3mm_Bridged_RoundedPad1.0x1.5mm" H 6950 3250 50  0001 C CNN
F 3 "~" H 6950 3250 50  0001 C CNN
	1    6950 3250
	0    -1   -1   0   
$EndComp
Wire Wire Line
	6950 3050 6950 3100
Wire Wire Line
	6950 3400 6950 3500
Connection ~ 6950 3500
Wire Wire Line
	6950 3500 7600 3500
$Comp
L Device:C C24
U 1 1 5F5C1405
P 9800 1450
F 0 "C24" V 9548 1450 50  0000 C CNN
F 1 "100n" V 9639 1450 50  0000 C CNN
F 2 "Capacitor_SMD:C_0805_2012Metric_Pad1.18x1.45mm_HandSolder" H 9838 1300 50  0001 C CNN
F 3 "~" H 9800 1450 50  0001 C CNN
	1    9800 1450
	-1   0    0    1   
$EndComp
Wire Wire Line
	7900 1150 7900 1250
Wire Wire Line
	9800 1300 9800 1250
Wire Wire Line
	9800 1250 7900 1250
Connection ~ 7900 1250
Wire Wire Line
	7900 1250 7900 1350
$Comp
L power:GND #PWR0134
U 1 1 5F5C5F8D
P 9800 1700
F 0 "#PWR0134" H 9800 1450 50  0001 C CNN
F 1 "GND" H 9805 1527 50  0000 C CNN
F 2 "" H 9800 1700 50  0001 C CNN
F 3 "" H 9800 1700 50  0001 C CNN
	1    9800 1700
	1    0    0    -1  
$EndComp
Wire Wire Line
	9800 1700 9800 1600
$EndSCHEMATC
