(module QFN_1610 (layer F.Cu) (tedit 6081D5BD)
  (fp_text reference REF** (at 0 2.5) (layer F.SilkS)
    (effects (font (size 1 1) (thickness 0.15)))
  )
  (fp_text value QFN_1610 (at 0 -3.3) (layer F.Fab)
    (effects (font (size 1 1) (thickness 0.15)))
  )
  (fp_line (start -0.8 -0.5) (end 0.8 -0.5) (layer F.SilkS) (width 0.12))
  (fp_line (start 0.8 0.5) (end -0.8 0.5) (layer F.SilkS) (width 0.12))
  (pad 1 smd rect (at 0.625 0) (size 0.55 0.8) (layers F.Cu F.Paste F.Mask))
  (pad 2 smd rect (at -0.625 0) (size 0.55 0.8) (layers F.Cu F.Paste F.Mask))
)
