(module DFN2510A-10 (layer F.Cu) (tedit 608AF7C7)
  (fp_text reference REF** (at 0 2) (layer F.SilkS)
    (effects (font (size 1 1) (thickness 0.15)))
  )
  (fp_text value DFN2510A-10 (at 0 -1.6) (layer F.Fab)
    (effects (font (size 1 1) (thickness 0.15)))
  )
  (fp_line (start -1.3 -0.8) (end -1.3 0.8) (layer F.SilkS) (width 0.12))
  (fp_line (start -1.3 0.8) (end 1.3 0.8) (layer F.SilkS) (width 0.12))
  (fp_line (start 1.3 0.8) (end 1.3 -0.8) (layer F.SilkS) (width 0.12))
  (fp_line (start 1.3 -0.8) (end -1.3 -0.8) (layer F.SilkS) (width 0.12))
  (fp_circle (center -1 1.1) (end -1 1) (layer F.SilkS) (width 0.12))
  (pad 1 smd rect (at -1 0.3875) (size 0.2 0.475) (layers F.Cu F.Paste F.Mask))
  (pad 2 smd rect (at -0.5 0.3875) (size 0.2 0.475) (layers F.Cu F.Paste F.Mask))
  (pad 3 smd rect (at 0 0.3875) (size 0.2 0.475) (layers F.Cu F.Paste F.Mask))
  (pad 4 smd rect (at 0.5 0.3875) (size 0.2 0.475) (layers F.Cu F.Paste F.Mask))
  (pad 5 smd rect (at 1 0.3875) (size 0.2 0.475) (layers F.Cu F.Paste F.Mask))
  (pad 6 smd rect (at 1 -0.3875) (size 0.2 0.475) (layers F.Cu F.Paste F.Mask))
  (pad 7 smd rect (at 0.5 -0.3875) (size 0.2 0.475) (layers F.Cu F.Paste F.Mask))
  (pad 8 smd rect (at 0 -0.3875) (size 0.2 0.475) (layers F.Cu F.Paste F.Mask))
  (pad 9 smd rect (at -0.5 -0.3875) (size 0.2 0.475) (layers F.Cu F.Paste F.Mask))
  (pad 10 smd rect (at -1 -0.3875) (size 0.2 0.475) (layers F.Cu F.Paste F.Mask))
)
