(module 436333045822 (layer F.Cu) (tedit 6095AED6)
  (fp_text reference REF** (at 0 -3) (layer F.SilkS)
    (effects (font (size 1 1) (thickness 0.15)))
  )
  (fp_text value 436333045822 (at 0 -2.54) (layer F.Fab)
    (effects (font (size 1 1) (thickness 0.15)))
  )
  (fp_line (start -2.5 0.2) (end -2.5 -0.2) (layer F.SilkS) (width 0.12))
  (fp_line (start 2.5 -0.2) (end 2.5 0.2) (layer F.SilkS) (width 0.12))
  (fp_line (start 2.5 1.8) (end 2.5 1.5) (layer F.SilkS) (width 0.12))
  (fp_line (start -2.5 1.5) (end -2.5 1.8) (layer F.SilkS) (width 0.12))
  (fp_line (start 2.5 -1.8) (end 0.3 -1.8) (layer F.SilkS) (width 0.12))
  (fp_line (start 2.5 -1.5) (end 2.5 -1.8) (layer F.SilkS) (width 0.12))
  (fp_line (start -2.5 -1.8) (end -2.5 -1.5) (layer F.SilkS) (width 0.12))
  (fp_line (start -2.3 -1.8) (end -2.5 -1.8) (layer F.SilkS) (width 0.12))
  (fp_line (start -2.3 -1.8) (end -0.3 -1.8) (layer F.SilkS) (width 0.12))
  (pad 1 smd rect (at -2.5 -0.85) (size 1 1) (layers F.Cu F.Paste F.Mask))
  (pad 2 smd rect (at 2.5 -0.85) (size 1 1) (layers F.Cu F.Paste F.Mask))
  (pad 3 smd rect (at 2.5 0.85) (size 1 1) (layers F.Cu F.Paste F.Mask))
  (pad 4 smd rect (at -2.5 0.85) (size 1 1) (layers F.Cu F.Paste F.Mask))
  (pad "" np_thru_hole circle (at 0 -1.375) (size 0.75 0.75) (drill 0.75) (layers *.Cu *.Mask))
  (pad "" np_thru_hole circle (at 0 1.375) (size 0.75 0.75) (drill 0.75) (layers *.Cu *.Mask))
  (model /opt/kamaro-kicad-libraries/kamaro-packages3d/436333045822/436333045822.stp
    (at (xyz 0 0 0))
    (scale (xyz 1 1 1))
    (rotate (xyz 0 0 90))
  )
)
