(module MOLEX-52885-0274 (layer F.Cu) (tedit 6078984A)
  (fp_text reference REF** (at 0.1 4.6) (layer F.SilkS)
    (effects (font (size 1 1) (thickness 0.15)))
  )
  (fp_text value MOLEX-52885-0274 (at 0.1 -4.7) (layer F.Fab)
    (effects (font (size 1 1) (thickness 0.15)))
  )
  (fp_line (start -5.6 3.3) (end -5.8 3.3) (layer F.SilkS) (width 0.12))
  (fp_line (start -7.1 2) (end -5.8 3.3) (layer F.SilkS) (width 0.12))
  (fp_line (start -3.2 3.3) (end -5.6 3.3) (layer F.SilkS) (width 0.12))
  (fp_line (start -7.1 1.1) (end -7.1 2) (layer F.SilkS) (width 0.12))
  (fp_line (start 7.2 3.2) (end 3.2 3.2) (layer F.SilkS) (width 0.12))
  (fp_line (start 7.2 1.2) (end 7.2 3.2) (layer F.SilkS) (width 0.12))
  (fp_line (start 7.1 -3.2) (end 7.1 -1.1) (layer F.SilkS) (width 0.12))
  (fp_line (start 7.1 -3.2) (end 3.2 -3.2) (layer F.SilkS) (width 0.12))
  (fp_line (start -7.1 -3.2) (end -3.2 -3.2) (layer F.SilkS) (width 0.12))
  (fp_line (start -7.1 -1.1) (end -7.1 -3.2) (layer F.SilkS) (width 0.12))
  (pad 12 smd rect (at -2.2225 -2.35) (size 0.35 2.5) (layers F.Cu F.Paste F.Mask))
  (pad 13 smd rect (at -1.5875 -2.35) (size 0.35 2.5) (layers F.Cu F.Paste F.Mask))
  (pad 14 smd rect (at -0.9525 -2.35) (size 0.35 2.5) (layers F.Cu F.Paste F.Mask))
  (pad 15 smd rect (at -0.3175 -2.35) (size 0.35 2.5) (layers F.Cu F.Paste F.Mask))
  (pad 16 smd rect (at 0.3175 -2.35) (size 0.35 2.5) (layers F.Cu F.Paste F.Mask))
  (pad 17 smd rect (at 0.9525 -2.35) (size 0.35 2.5) (layers F.Cu F.Paste F.Mask))
  (pad 18 smd rect (at 1.5875 -2.35) (size 0.35 2.5) (layers F.Cu F.Paste F.Mask))
  (pad 19 smd rect (at 2.2225 -2.35) (size 0.35 2.5) (layers F.Cu F.Paste F.Mask))
  (pad 20 smd rect (at 2.8575 -2.35) (size 0.35 2.5) (layers F.Cu F.Paste F.Mask))
  (pad 11 smd rect (at -2.8575 -2.35) (size 0.35 2.5) (layers F.Cu F.Paste F.Mask))
  (pad 1 smd rect (at -2.8575 2.35) (size 0.35 2.5) (layers F.Cu F.Paste F.Mask))
  (pad 2 smd rect (at -2.2225 2.35) (size 0.35 2.5) (layers F.Cu F.Paste F.Mask))
  (pad 3 smd rect (at -1.5875 2.35) (size 0.35 2.5) (layers F.Cu F.Paste F.Mask))
  (pad 4 smd rect (at -0.9525 2.35) (size 0.35 2.5) (layers F.Cu F.Paste F.Mask))
  (pad 5 smd rect (at -0.3175 2.35) (size 0.35 2.5) (layers F.Cu F.Paste F.Mask))
  (pad 6 smd rect (at 0.3175 2.35) (size 0.35 2.5) (layers F.Cu F.Paste F.Mask))
  (pad 7 smd rect (at 0.9525 2.35) (size 0.35 2.5) (layers F.Cu F.Paste F.Mask))
  (pad 8 smd rect (at 1.5875 2.35 180) (size 0.35 2.5) (layers F.Cu F.Paste F.Mask))
  (pad 9 smd rect (at 2.2225 2.35) (size 0.35 2.5) (layers F.Cu F.Paste F.Mask))
  (pad 10 smd rect (at 2.8575 2.35) (size 0.35 2.5) (layers F.Cu F.Paste F.Mask))
  (pad "" np_thru_hole circle (at -4.51 0) (size 0.9 0.9) (drill 0.9) (layers *.Cu *.Mask))
  (pad "" np_thru_hole circle (at 4.51 0) (size 0.7 0.7) (drill 0.7) (layers *.Cu *.Mask))
  (pad "" smd rect (at -6.56 0) (size 2.5 2) (layers F.Cu F.Paste F.Mask))
  (pad "" smd rect (at 6.56 0) (size 2.5 2) (layers F.Cu F.Paste F.Mask))
  (model /opt/kamaro-kicad-libraries/kamaro-packages3d/MOLEX-52885-0274/528850274.stp
    (offset (xyz 0 0 2))
    (scale (xyz 1 1 1))
    (rotate (xyz -90 0 0))
  )
)
