<?xml version="1.0" standalone="no"?>
<!DOCTYPE svg PUBLIC "-//W3C//DTD SVG 20010904//EN"
 "http://www.w3.org/TR/2001/REC-SVG-20010904/DTD/svg10.dtd">
<svg version="1.0" xmlns="http://www.w3.org/2000/svg"
 width="500.000000pt" height="500.000000pt" viewBox="0 0 500.000000 500.000000"
 preserveAspectRatio="xMidYMid meet">
<metadata>
Created by potrace 1.11, written by Peter Selinger 2001-2013
</metadata>
<g transform="translate(0.000000,500.000000) scale(0.100000,-0.100000)"
fill="#000000" stroke="none">
<path d="M190 2505 l0 -2295 2310 0 2310 0 0 2295 0 2295 -2310 0 -2310 0 0
-2295z m4240 1914 c4 -6 5 -3813 1 -3829 -1 -7 -3861 -7 -3862 0 -3 13 -5
3816 -2 3825 4 12 3855 15 3863 4z"/>
<path d="M1611 2853 c-73 -197 -137 -367 -142 -378 -9 -22 -170 -452 -225
-602 l-33 -93 123 0 124 0 68 200 69 200 274 -2 274 -3 45 -125 c24 -69 56
-158 70 -197 l25 -73 123 0 c68 0 124 1 124 3 0 2 -24 68 -54 148 -29 79 -139
374 -244 654 -104 281 -200 536 -212 568 l-21 57 -128 0 -127 0 -133 -357z
m301 19 c20 -64 66 -201 102 -304 l65 -188 -204 0 c-122 0 -205 4 -205 9 0 6
11 40 25 78 60 169 145 417 151 441 3 15 8 39 11 55 3 15 8 27 12 27 3 0 23
-53 43 -118z"/>
<path d="M2717 2523 c1 -378 2 -700 2 -715 l1 -28 115 0 115 0 0 285 0 286
117 -3 118 -3 52 -85 c29 -47 60 -100 70 -118 10 -18 62 -107 117 -197 l98
-165 134 0 134 0 -82 128 c-44 70 -135 212 -201 315 -66 103 -118 189 -116
190 2 1 26 13 53 27 109 55 193 163 211 270 32 188 -30 343 -168 424 -103 60
-195 74 -512 75 l-260 2 2 -688z m574 458 c31 -12 65 -31 77 -44 59 -62 71
-184 27 -271 -45 -92 -120 -121 -321 -125 l-124 -2 0 237 0 237 143 -5 c113
-4 153 -10 198 -27z"/>
</g>
</svg>
