﻿[{
  "_id" : ObjectId("5c4f8465ff7f08370455cbe8"),
  "currentQuestionIdx" : -1,
  "result" : 3,
  "userName" : "Kalvis",
  "testId" : ObjectId("5c4cab584c02d1c997c34d31"),
  "startDateTime" : ISODate("2019-01-28T22:38:29.499Z"),
  "currentQuestion" : null,
  "questionCnt" : 3,
  "__v" : 0
},
{
  "_id" : ObjectId("5c4f8475ff7f08370455cbe9"),
  "currentQuestionIdx" : -1,
  "result" : 1,
  "userName" : "Testa useris",
  "testId" : ObjectId("5c4cab144c02d1c997c34d0b"),
  "startDateTime" : ISODate("2019-01-28T22:38:45.736Z"),
  "currentQuestion" : null,
  "questionCnt" : 3,
  "__v" : 0
},
]