{
	"domain": "中文网",
	"whoisServer": "whois.teleinfo.cn",
	"rdapURLs": [
		"https://rdap.teleinfo.cn/xn--fiq228c5hs/"
	],
	"nameServers": [
		"ns1.teleinfo.cn",
		"ns2.teleinfoo.com",
		"ns3.teleinfo.cn",
		"ns4.teleinfoo.com"
	],
	"tags": [
		"generic"
	],
	"policies": [
		{
			"type": "idn-table",
			"key": "zh-CN",
			"value": "https://www.iana.org/domains/idn-tables/tables/xn--fiq228c5hs_zh-cn_4.0.txt"
		},
		{
			"type": "idn-table",
			"key": "zh-Hant",
			"value": "https://www.iana.org/domains/idn-tables/tables/xn--fiq228c5hs_zh-hant_4.0.1.txt"
		}
	]
}
