{
	"domain": "العليان",
	"infoURL": "https://newgtlds.icann.org/",
	"whoisServer": "whois.nic.العليان",
	"rdapURLs": [
		"https://rdap.nic.العليان/"
	],
	"nameServers": [
		"a.nic.العليان",
		"b.nic.العليان",
		"c.nic.العليان",
		"d.nic.العليان"
	],
	"tags": [
		"generic"
	],
	"policies": [
		{
			"type": "idn-table",
			"key": "ar",
			"value": "https://www.iana.org/domains/idn-tables/tables/xn--mgba7c0bbn0a_ar_3.0.xml"
		}
	]
}
