{
	"domain": "frogans",
	"infoURL": "https://newgtlds.icann.org/",
	"whoisServer": "whois.nic.frogans",
	"rdapURLs": [
		"https://rdap.afilias-srs.net/rdap/frogans/"
	],
	"nameServers": [
		"a0.nic.frogans",
		"a2.nic.frogans",
		"b0.nic.frogans",
		"c0.nic.frogans"
	],
	"tags": [
		"brand",
		"generic"
	],
	"policies": [
		{
			"type": "idn-table",
			"key": "mul-Latn",
			"value": "https://www.iana.org/domains/idn-tables/tables/frogans_latn_1.txt"
		}
	]
}
