{
	"domain": "th",
	"infoURL": "https://www.thnic.co.th/",
	"whoisServer": "whois.thnic.co.th",
	"nameServers": [
		"a.thains.co.th",
		"b.thains.co.th",
		"c.thains.co.th",
		"ns.thnic.net",
		"p.thains.co.th"
	],
	"tags": [
		"closed",
		"country",
		"geo"
	],
	"policies": [
		{
			"type": "idn-table",
			"key": "th-TH",
			"value": "https://www.iana.org/domains/idn-tables/tables/th_th-th_1.0.html"
		}
	]
}
