{
	"domain": "السعودية",
	"whoisServer": "whois.nic.net.sa",
	"nameServers": [
		"c1.dns.sa",
		"c2.dns.sa",
		"i1.dns.sa",
		"n1.dns.sa",
		"p1.dns.sa",
		"s1.dns.sa",
		"s2.dns.sa"
	],
	"languages": [
		"ar-SA"
	],
	"tags": [
		"country",
		"geo"
	],
	"policies": [
		{
			"type": "idn-table",
			"key": "ar",
			"value": "https://www.iana.org/domains/idn-tables/tables/xn--mgberp4a5d4ar_ar_2.xml"
		}
	]
}
