{
	"domain": "pw",
	"whoisServer": "whois.nic.pw",
	"rdapURLs": [
		"https://rdap.centralnic.com/pw/"
	],
	"nameServers": [
		"ns1.nic.pw",
		"ns2.nic.pw",
		"ns5.nic.pw",
		"ns6.nic.pw"
	],
	"tags": [
		"country",
		"geo"
	],
	"policies": [
		{
			"type": "idn-table",
			"key": "ar",
			"value": "https://www.iana.org/domains/idn-tables/tables/pw_ar_1.1.txt"
		},
		{
			"type": "idn-table",
			"key": "he",
			"value": "https://www.iana.org/domains/idn-tables/tables/pw_he_1.0.txt"
		},
		{
			"type": "idn-table",
			"key": "ja",
			"value": "https://www.iana.org/domains/idn-tables/tables/pw_ja_1.0.txt"
		},
		{
			"type": "idn-table",
			"key": "ko",
			"value": "https://www.iana.org/domains/idn-tables/tables/pw_ko_1.0.txt"
		},
		{
			"type": "idn-table",
			"key": "lo",
			"value": "https://www.iana.org/domains/idn-tables/tables/pw_lo_2.0.txt"
		},
		{
			"type": "idn-table",
			"key": "mul-Cyrl",
			"value": "https://www.iana.org/domains/idn-tables/tables/pw_cyrl_1.1.txt"
		},
		{
			"type": "idn-table",
			"key": "mul-Grek",
			"value": "https://www.iana.org/domains/idn-tables/tables/pw_grek_1.1.txt"
		},
		{
			"type": "idn-table",
			"key": "mul-Latn",
			"value": "https://www.iana.org/domains/idn-tables/tables/pw_latn_1.0.txt"
		},
		{
			"type": "idn-table",
			"key": "th",
			"value": "https://www.iana.org/domains/idn-tables/tables/pw_th_2.0.txt"
		},
		{
			"type": "idn-table",
			"key": "zh",
			"value": "https://www.iana.org/domains/idn-tables/tables/pw_zh_1.0.txt"
		}
	]
}
