{
	"domain": "nyc",
	"whoisServer": "whois.nic.nyc",
	"rdapURLs": [
		"https://rdap.nic.nyc/"
	],
	"nameServers": [
		"ns1.dns.nic.nyc",
		"ns2.dns.nic.nyc",
		"ns3.dns.nic.nyc",
		"ns4.dns.nic.nyc",
		"ns5.dns.nic.nyc",
		"ns6.dns.nic.nyc"
	],
	"locations": [
		"New York City"
	],
	"tags": [
		"city",
		"generic",
		"geo"
	],
	"policies": [
		{
			"type": "idn-table",
			"key": "es",
			"value": "https://www.iana.org/domains/idn-tables/tables/nyc_es_3.0.xml"
		}
	]
}
