{
	"domain": "ලංකා",
	"whoisServer": "whois.nic.lk",
	"nameServers": [
		"lk.communitydns.net",
		"nic.lk-anycast.pch.net",
		"ns-c.nic.lk",
		"ns-d.nic.lk",
		"ns-l.nic.lk",
		"ns-t.nic.lk",
		"ns1.ac.lk",
		"ns3.ac.lk"
	],
	"tags": [
		"generic"
	]
}
