{
	"domain": "اتصالات",
	"infoURL": "https://newgtlds.icann.org/",
	"whoisServer": "whois.centralnic.com",
	"rdapURLs": [
		"https://rdap.centralnic.com/xn--mgbaakc7dvf/"
	],
	"nameServers": [
		"a.nic.اتصالات",
		"b.nic.اتصالات",
		"c.nic.اتصالات",
		"d.nic.اتصالات"
	],
	"tags": [
		"generic"
	],
	"policies": [
		{
			"type": "idn-table",
			"key": "ar",
			"value": "https://www.iana.org/domains/idn-tables/tables/xn--mgbaakc7dvf_ar_1.1.txt"
		}
	]
}
