{
	"domain": "москва",
	"whoisServer": "whois.nic.москва",
	"rdapURLs": [
		"https://flexireg.net/xn--80adxhks/rdap/"
	],
	"nameServers": [
		"a.dns.flexireg.ru",
		"b.dns.flexireg.net",
		"c.dns.flexireg.org",
		"d.dns.flexireg.domains"
	],
	"locations": [
		"Moscow"
	],
	"tags": [
		"city",
		"generic",
		"geo"
	],
	"policies": [
		{
			"type": "idn-table",
			"key": "ru",
			"value": "https://www.iana.org/domains/idn-tables/tables/xn--80adxhks_ru_1.0.txt"
		}
	]
}
