{
	"domain": "london",
	"infoURL": "http://nic.london/",
	"whoisServer": "whois.nic.london",
	"rdapURLs": [
		"https://rdap.nominet.uk/london/"
	],
	"nameServers": [
		"dns1.nic.london",
		"dns2.nic.london",
		"dns3.nic.london",
		"dns4.nic.london",
		"dnsa.nic.london",
		"dnsb.nic.london",
		"dnsc.nic.london",
		"dnsd.nic.london"
	],
	"locations": [
		"London",
		"GB-LND",
		"GB-BDG",
		"GB-BNE",
		"GB-BEX",
		"GB-BEN",
		"GB-BRY",
		"GB-CMD",
		"GB-CRY",
		"GB-EAL",
		"GB-ENF",
		"GB-GRE",
		"GB-HCK",
		"GB-HMF",
		"GB-HRY",
		"GB-HRW",
		"GB-HAV",
		"GB-HIL",
		"GB-HNS",
		"GB-ISL",
		"GB-KEC",
		"GB-KTT",
		"GB-LBH",
		"GB-LEW",
		"GB-MRT",
		"GB-NWM",
		"GB-RDB",
		"GB-RIC",
		"GB-SWK",
		"GB-STN",
		"GB-TWH",
		"GB-WFT",
		"GB-WND",
		"GB-WSM"
	],
	"tags": [
		"city",
		"generic",
		"geo"
	],
	"policies": [
		{
			"type": "idn-table",
			"key": "de",
			"value": "https://www.iana.org/domains/idn-tables/tables/london_de_1.0.txt",
			"comment": "https://registrars.nominet.uk/gtlds/gtld-registrar-systems/internationalised-domain-names-idns"
		},
		{
			"type": "idn-table",
			"key": "es",
			"value": "https://www.iana.org/domains/idn-tables/tables/london_es_1.0.txt",
			"comment": "https://registrars.nominet.uk/gtlds/gtld-registrar-systems/internationalised-domain-names-idns"
		},
		{
			"type": "idn-table",
			"key": "fr",
			"value": "https://www.iana.org/domains/idn-tables/tables/london_fr_1.0.txt",
			"comment": "https://registrars.nominet.uk/gtlds/gtld-registrar-systems/internationalised-domain-names-idns"
		},
		{
			"type": "idn-table",
			"key": "it",
			"value": "https://www.iana.org/domains/idn-tables/tables/london_it_1.0.txt",
			"comment": "https://registrars.nominet.uk/gtlds/gtld-registrar-systems/internationalised-domain-names-idns"
		}
	]
}
