{
	"domain": "aetna",
	"infoURL": "https://newgtlds.icann.org/",
	"whoisServer": "whois.nic.aetna",
	"rdapURLs": [
		"https://rdap.nic.aetna/"
	],
	"nameServers": [
		"ns1.dns.nic.aetna",
		"ns2.dns.nic.aetna",
		"ns3.dns.nic.aetna",
		"ns4.dns.nic.aetna",
		"ns5.dns.nic.aetna",
		"ns6.dns.nic.aetna"
	],
	"tags": [
		"brand",
		"generic"
	],
	"policies": [
		{
			"type": "idn-table",
			"key": "es",
			"value": "https://www.iana.org/domains/idn-tables/tables/aetna_es_3.0.xml"
		},
		{
			"type": "idn-table",
			"key": "pt",
			"value": "https://www.iana.org/domains/idn-tables/tables/aetna_pt_3.0.xml"
		}
	]
}
