{
	"domain": "kim",
	"infoURL": "https://get.kim/",
	"whoisServer": "whois.afilias.net",
	"rdapURLs": [
		"https://rdap.afilias.net/rdap/kim/"
	],
	"nameServers": [
		"a0.nic.kim",
		"a2.nic.kim",
		"b0.nic.kim",
		"c0.nic.kim"
	],
	"tags": [
		"generic"
	],
	"policies": [
		{
			"type": "idn-table",
			"key": "ar",
			"value": "https://www.iana.org/domains/idn-tables/tables/kim_ar_1.txt"
		},
		{
			"type": "idn-table",
			"key": "be",
			"value": "https://www.iana.org/domains/idn-tables/tables/kim_be_1.txt"
		},
		{
			"type": "idn-table",
			"key": "bg",
			"value": "https://www.iana.org/domains/idn-tables/tables/kim_bg_1.txt"
		},
		{
			"type": "idn-table",
			"key": "bs",
			"value": "https://www.iana.org/domains/idn-tables/tables/kim_bs_1.txt"
		},
		{
			"type": "idn-table",
			"key": "da",
			"value": "https://www.iana.org/domains/idn-tables/tables/kim_da_1.txt"
		},
		{
			"type": "idn-table",
			"key": "de",
			"value": "https://www.iana.org/domains/idn-tables/tables/kim_de_1.txt"
		},
		{
			"type": "idn-table",
			"key": "es",
			"value": "https://www.iana.org/domains/idn-tables/tables/kim_es_1.txt"
		},
		{
			"type": "idn-table",
			"key": "fi",
			"value": "https://www.iana.org/domains/idn-tables/tables/kim_fi_1.txt"
		},
		{
			"type": "idn-table",
			"key": "fr",
			"value": "https://www.iana.org/domains/idn-tables/tables/kim_fr_1.txt"
		},
		{
			"type": "idn-table",
			"key": "hi",
			"value": "https://www.iana.org/domains/idn-tables/tables/kim_hi_1.txt"
		},
		{
			"type": "idn-table",
			"key": "hu",
			"value": "https://www.iana.org/domains/idn-tables/tables/kim_hu_1.txt"
		},
		{
			"type": "idn-table",
			"key": "is",
			"value": "https://www.iana.org/domains/idn-tables/tables/kim_is_1.txt"
		},
		{
			"type": "idn-table",
			"key": "it",
			"value": "https://www.iana.org/domains/idn-tables/tables/kim_it_1.txt"
		},
		{
			"type": "idn-table",
			"key": "ko",
			"value": "https://www.iana.org/domains/idn-tables/tables/kim_ko_1.txt"
		},
		{
			"type": "idn-table",
			"key": "lt",
			"value": "https://www.iana.org/domains/idn-tables/tables/kim_lt_1.txt"
		},
		{
			"type": "idn-table",
			"key": "lv",
			"value": "https://www.iana.org/domains/idn-tables/tables/kim_lv_1.txt"
		},
		{
			"type": "idn-table",
			"key": "mk",
			"value": "https://www.iana.org/domains/idn-tables/tables/kim_mk_1.txt"
		},
		{
			"type": "idn-table",
			"key": "pl",
			"value": "https://www.iana.org/domains/idn-tables/tables/kim_pl_1.txt"
		},
		{
			"type": "idn-table",
			"key": "pt",
			"value": "https://www.iana.org/domains/idn-tables/tables/kim_pt_1.txt"
		},
		{
			"type": "idn-table",
			"key": "ru",
			"value": "https://www.iana.org/domains/idn-tables/tables/kim_ru_1.txt"
		},
		{
			"type": "idn-table",
			"key": "sr",
			"value": "https://www.iana.org/domains/idn-tables/tables/kim_sr_1.txt"
		},
		{
			"type": "idn-table",
			"key": "sr-ME",
			"value": "https://www.iana.org/domains/idn-tables/tables/kim_sr-me_1.txt"
		},
		{
			"type": "idn-table",
			"key": "sv",
			"value": "https://www.iana.org/domains/idn-tables/tables/kim_sv_1.txt"
		},
		{
			"type": "idn-table",
			"key": "uk",
			"value": "https://www.iana.org/domains/idn-tables/tables/kim_uk_1.txt"
		},
		{
			"type": "idn-table",
			"key": "zh-CN",
			"value": "https://www.iana.org/domains/idn-tables/tables/kim_zh-cn_4.0.txt"
		},
		{
			"type": "idn-table",
			"key": "zh-TW",
			"value": "https://www.iana.org/domains/idn-tables/tables/kim_zh-tw_4.0.txt"
		}
	]
}
