{
	"domain": "fit",
	"infoURL": "http://nic.fit/",
	"whoisServer": "whois.nic.fit",
	"rdapURLs": [
		"https://rdap.nominet.uk/fit/"
	],
	"nameServers": [
		"dns1.nic.fit",
		"dns2.nic.fit",
		"dns3.nic.fit",
		"dns4.nic.fit",
		"dnsa.nic.fit",
		"dnsb.nic.fit",
		"dnsc.nic.fit",
		"dnsd.nic.fit"
	],
	"tags": [
		"generic"
	],
	"policies": [
		{
			"type": "idn-table",
			"key": "de",
			"value": "https://www.iana.org/domains/idn-tables/tables/fit_de_1.0.txt",
			"comment": "https://registrars.nominet.uk/gtlds/gtld-registrar-systems/internationalised-domain-names-idns"
		},
		{
			"type": "idn-table",
			"key": "es",
			"value": "https://www.iana.org/domains/idn-tables/tables/fit_es_1.0.txt",
			"comment": "https://registrars.nominet.uk/gtlds/gtld-registrar-systems/internationalised-domain-names-idns"
		},
		{
			"type": "idn-table",
			"key": "fr",
			"value": "https://www.iana.org/domains/idn-tables/tables/fit_fr_1.0.txt",
			"comment": "https://registrars.nominet.uk/gtlds/gtld-registrar-systems/internationalised-domain-names-idns"
		},
		{
			"type": "idn-table",
			"key": "zh",
			"value": "https://www.iana.org/domains/idn-tables/tables/fit_zh_1.0.txt"
		}
	]
}
