{
	"domain": "beer",
	"infoURL": "http://nic.beer/",
	"whoisServer": "whois.nic.beer",
	"rdapURLs": [
		"https://rdap.nominet.uk/beer/"
	],
	"nameServers": [
		"dns1.nic.beer",
		"dns2.nic.beer",
		"dns3.nic.beer",
		"dns4.nic.beer",
		"dnsa.nic.beer",
		"dnsb.nic.beer",
		"dnsc.nic.beer",
		"dnsd.nic.beer"
	],
	"tags": [
		"generic"
	],
	"policies": [
		{
			"type": "idn-table",
			"key": "de",
			"value": "https://www.iana.org/domains/idn-tables/tables/beer_de_1.0.txt",
			"comment": "https://registrars.nominet.uk/gtlds/gtld-registrar-systems/internationalised-domain-names-idns"
		},
		{
			"type": "idn-table",
			"key": "es",
			"value": "https://www.iana.org/domains/idn-tables/tables/beer_es_1.0.txt",
			"comment": "https://registrars.nominet.uk/gtlds/gtld-registrar-systems/internationalised-domain-names-idns"
		},
		{
			"type": "idn-table",
			"key": "fr",
			"value": "https://www.iana.org/domains/idn-tables/tables/beer_fr_1.0.txt",
			"comment": "https://registrars.nominet.uk/gtlds/gtld-registrar-systems/internationalised-domain-names-idns"
		},
		{
			"type": "idn-table",
			"key": "zh",
			"value": "https://www.iana.org/domains/idn-tables/tables/beer_zh_1.0.txt"
		}
	]
}
