{
	"domain": "work",
	"infoURL": "http://nic.work/",
	"whoisServer": "whois.nic.work",
	"rdapURLs": [
		"https://rdap.nominet.uk/work/"
	],
	"nameServers": [
		"dns1.nic.work",
		"dns2.nic.work",
		"dns3.nic.work",
		"dns4.nic.work",
		"dnsa.nic.work",
		"dnsb.nic.work",
		"dnsc.nic.work",
		"dnsd.nic.work"
	],
	"tags": [
		"generic"
	],
	"policies": [
		{
			"type": "idn-table",
			"key": "de",
			"value": "https://www.iana.org/domains/idn-tables/tables/work_de_1.0.txt",
			"comment": "https://registrars.nominet.uk/gtlds/gtld-registrar-systems/internationalised-domain-names-idns"
		},
		{
			"type": "idn-table",
			"key": "es",
			"value": "https://www.iana.org/domains/idn-tables/tables/work_es_1.0.txt",
			"comment": "https://registrars.nominet.uk/gtlds/gtld-registrar-systems/internationalised-domain-names-idns"
		},
		{
			"type": "idn-table",
			"key": "fr",
			"value": "https://www.iana.org/domains/idn-tables/tables/work_fr_1.0.txt",
			"comment": "https://registrars.nominet.uk/gtlds/gtld-registrar-systems/internationalised-domain-names-idns"
		},
		{
			"type": "idn-table",
			"key": "zh",
			"value": "https://www.iana.org/domains/idn-tables/tables/work_zh_1.0.txt"
		}
	]
}
