{
	"domain": "onyourside",
	"infoURL": "https://newgtlds.icann.org/",
	"whoisServer": "whois.nic.onyourside",
	"rdapURLs": [
		"https://tld-rdap.verisign.com/onyourside/v1/"
	],
	"nameServers": [
		"ac1.nstld.com",
		"ac2.nstld.com",
		"ac3.nstld.com",
		"ac4.nstld.com"
	],
	"tags": [
		"brand",
		"generic"
	],
	"policies": [
		{
			"type": "idn-disallowed"
		}
	]
}
