{
	"domain": "wiki",
	"whoisServer": "whois.nic.wiki",
	"rdapURLs": [
		"https://rdap.centralnic.com/wiki/"
	],
	"nameServers": [
		"a.nic.wiki",
		"b.nic.wiki",
		"c.nic.wiki",
		"d.nic.wiki"
	],
	"tags": [
		"generic"
	],
	"policies": [
		{
			"type": "idn-table",
			"key": "ar",
			"value": "https://www.iana.org/domains/idn-tables/tables/wiki_ar_1.1.txt"
		},
		{
			"type": "idn-table",
			"key": "he",
			"value": "https://www.iana.org/domains/idn-tables/tables/wiki_he_1.0.txt"
		},
		{
			"type": "idn-table",
			"key": "ko",
			"value": "https://www.iana.org/domains/idn-tables/tables/wiki_ko_1.0.txt"
		},
		{
			"type": "idn-table",
			"key": "lo",
			"value": "https://www.iana.org/domains/idn-tables/tables/wiki_lo_2.0.txt"
		},
		{
			"type": "idn-table",
			"key": "mul-Cyrl",
			"value": "https://www.iana.org/domains/idn-tables/tables/wiki_cyrl_1.1.txt"
		},
		{
			"type": "idn-table",
			"key": "mul-Grek",
			"value": "https://www.iana.org/domains/idn-tables/tables/wiki_grek_1.1.txt"
		},
		{
			"type": "idn-table",
			"key": "mul-Latn",
			"value": "https://www.iana.org/domains/idn-tables/tables/wiki_latn_1.0.txt"
		},
		{
			"type": "idn-table",
			"key": "th",
			"value": "https://www.iana.org/domains/idn-tables/tables/wiki_th_2.0.txt"
		}
	]
}
