{
	"domain": "食品",
	"infoURL": "https://newgtlds.icann.org/",
	"whoisServer": "whois.nic.食品",
	"rdapURLs": [
		"https://rdap.nic.食品/"
	],
	"nameServers": [
		"ns1.dns.nic.食品",
		"ns2.dns.nic.食品",
		"ns3.dns.nic.食品",
		"ns4.dns.nic.食品",
		"ns5.dns.nic.食品",
		"ns6.dns.nic.食品"
	],
	"policies": [
		{
			"type": "idn-table",
			"key": "ar",
			"value": "https://www.iana.org/domains/idn-tables/tables/xn--jvr189m_ar_2.1.txt"
		},
		{
			"type": "idn-table",
			"key": "da",
			"value": "https://www.iana.org/domains/idn-tables/tables/xn--jvr189m_da_2.1.txt"
		},
		{
			"type": "idn-table",
			"key": "de",
			"value": "https://www.iana.org/domains/idn-tables/tables/xn--jvr189m_de_2.1.txt"
		},
		{
			"type": "idn-table",
			"key": "es",
			"value": "https://www.iana.org/domains/idn-tables/tables/xn--jvr189m_es_2.1.txt"
		},
		{
			"type": "idn-table",
			"key": "fi",
			"value": "https://www.iana.org/domains/idn-tables/tables/xn--jvr189m_fi_2.1.txt"
		},
		{
			"type": "idn-table",
			"key": "fr",
			"value": "https://www.iana.org/domains/idn-tables/tables/xn--jvr189m_fr_2.1.txt"
		},
		{
			"type": "idn-table",
			"key": "hu",
			"value": "https://www.iana.org/domains/idn-tables/tables/xn--jvr189m_hu_2.1.txt"
		},
		{
			"type": "idn-table",
			"key": "is",
			"value": "https://www.iana.org/domains/idn-tables/tables/xn--jvr189m_is_2.1.txt"
		},
		{
			"type": "idn-table",
			"key": "ja",
			"value": "https://www.iana.org/domains/idn-tables/tables/xn--jvr189m_ja_2.1.txt"
		},
		{
			"type": "idn-table",
			"key": "ko",
			"value": "https://www.iana.org/domains/idn-tables/tables/xn--jvr189m_ko_2.1.txt"
		},
		{
			"type": "idn-table",
			"key": "lt",
			"value": "https://www.iana.org/domains/idn-tables/tables/xn--jvr189m_lt_2.1.txt"
		},
		{
			"type": "idn-table",
			"key": "lv",
			"value": "https://www.iana.org/domains/idn-tables/tables/xn--jvr189m_lv_2.1.txt"
		},
		{
			"type": "idn-table",
			"key": "no",
			"value": "https://www.iana.org/domains/idn-tables/tables/xn--jvr189m_no_2.1.txt"
		},
		{
			"type": "idn-table",
			"key": "pl",
			"value": "https://www.iana.org/domains/idn-tables/tables/xn--jvr189m_pl_2.1.txt"
		},
		{
			"type": "idn-table",
			"key": "pt",
			"value": "https://www.iana.org/domains/idn-tables/tables/xn--jvr189m_pt_2.1.txt"
		},
		{
			"type": "idn-table",
			"key": "ru",
			"value": "https://www.iana.org/domains/idn-tables/tables/xn--jvr189m_ru_2.1.txt"
		},
		{
			"type": "idn-table",
			"key": "sv",
			"value": "https://www.iana.org/domains/idn-tables/tables/xn--jvr189m_sv_2.1.txt"
		},
		{
			"type": "idn-table",
			"key": "zh",
			"value": "https://www.iana.org/domains/idn-tables/tables/xn--jvr189m_zh_2.1.txt"
		}
	]
}
