{
	"domain": "bayern",
	"infoURL": "https://nic.bayern/",
	"whoisServer": "whois.nic.bayern",
	"rdapURLs": [
		"https://rdap.nominet.uk/bayern/"
	],
	"nameServers": [
		"dns1.nic.bayern",
		"dns2.nic.bayern",
		"dns3.nic.bayern",
		"dns4.nic.bayern",
		"dnsa.nic.bayern",
		"dnsb.nic.bayern",
		"dnsc.nic.bayern",
		"dnsd.nic.bayern"
	],
	"locations": [
		"DE-BY"
	],
	"tags": [
		"generic",
		"geo",
		"region"
	],
	"policies": [
		{
			"type": "idn-table",
			"key": "de",
			"value": "https://www.iana.org/domains/idn-tables/tables/bayern_de_1.0.txt",
			"comment": "https://registrars.nominet.uk/gtlds/gtld-registrar-systems/internationalised-domain-names-idns"
		}
	]
}
