{
	"domain": "ggee",
	"infoURL": "https://newgtlds.icann.org/",
	"whoisServer": "whois.nic.ggee",
	"rdapURLs": [
		"https://rdap.gmoregistry.net/rdap/"
	],
	"nameServers": [
		"a.gmoregistry.net",
		"b.gmoregistry.net",
		"k.gmoregistry.net",
		"l.gmoregistry.net"
	],
	"tags": [
		"brand",
		"generic"
	],
	"policies": [
		{
			"type": "idn-table",
			"key": "es",
			"value": "https://www.iana.org/domains/idn-tables/tables/ggee_es_1.0.txt"
		},
		{
			"type": "idn-table",
			"key": "fr",
			"value": "https://www.iana.org/domains/idn-tables/tables/ggee_fr_1.0.txt"
		},
		{
			"type": "idn-table",
			"key": "ja",
			"value": "https://www.iana.org/domains/idn-tables/tables/ggee_ja_1.0.txt"
		},
		{
			"type": "idn-table",
			"key": "ko",
			"value": "https://www.iana.org/domains/idn-tables/tables/ggee_ko_1.0.txt"
		},
		{
			"type": "idn-table",
			"key": "pl",
			"value": "https://www.iana.org/domains/idn-tables/tables/ggee_pl_1.0.txt"
		},
		{
			"type": "idn-table",
			"key": "pt",
			"value": "https://www.iana.org/domains/idn-tables/tables/ggee_pt_1.0.txt"
		}
	]
}
