{
	"domain": "ford",
	"infoURL": "https://newgtlds.icann.org/",
	"whoisServer": "whois.nic.ford",
	"rdapURLs": [
		"https://rdap.nic.ford/"
	],
	"nameServers": [
		"ns1.dns.nic.ford",
		"ns2.dns.nic.ford",
		"ns3.dns.nic.ford",
		"ns4.dns.nic.ford",
		"ns5.dns.nic.ford",
		"ns6.dns.nic.ford"
	],
	"tags": [
		"brand",
		"generic"
	],
	"policies": [
		{
			"type": "idn-table",
			"key": "da",
			"value": "https://www.iana.org/domains/idn-tables/tables/ford_da_3.0.xml"
		},
		{
			"type": "idn-table",
			"key": "fr",
			"value": "https://www.iana.org/domains/idn-tables/tables/ford_fr_3.0.xml"
		},
		{
			"type": "idn-table",
			"key": "pl",
			"value": "https://www.iana.org/domains/idn-tables/tables/ford_pl_3.0.xml"
		},
		{
			"type": "idn-table",
			"key": "ru",
			"value": "https://www.iana.org/domains/idn-tables/tables/ford_ru_3.0.xml"
		},
		{
			"type": "idn-table",
			"key": "sv",
			"value": "https://www.iana.org/domains/idn-tables/tables/ford_sv_3.0.xml"
		},
		{
			"type": "idn-table",
			"key": "zh",
			"value": "https://www.iana.org/domains/idn-tables/tables/ford_zh_3.0.xml"
		}
	]
}
