{
	"domain": "台湾",
	"whoisServer": "whois.twnic.net.tw",
	"nameServers": [
		"anytld.apnic.net",
		"d.dns.tw",
		"e.dns.tw",
		"f.dns.tw",
		"g.dns.tw",
		"h.dns.tw"
	],
	"languages": [
		"zh-Hans-TW"
	]
}
