{
	"domain": "abbvie",
	"infoURL": "https://newgtlds.icann.org/",
	"whoisServer": "whois.afilias-srs.net",
	"rdapURLs": [
		"https://rdap.afilias-srs.net/rdap/abbvie/"
	],
	"nameServers": [
		"a0.nic.abbvie",
		"a2.nic.abbvie",
		"b0.nic.abbvie",
		"c0.nic.abbvie"
	],
	"tags": [
		"brand",
		"generic"
	],
	"policies": [
		{
			"type": "idn-disallowed"
		}
	]
}
