{
	"domain": "تونس",
	"whoisServer": "whois.ati.tn",
	"nameServers": [
		"ns-tn.afrinic.net",
		"ns1.ati.tn",
		"ns2.ati.tn",
		"ns2.nic.fr",
		"pch.ati.tn",
		"rip.psg.com"
	],
	"tags": [
		"generic"
	]
}
