{
	"domain": "nu",
	"infoURL": "https://www.nic.nu/",
	"whoisServer": "whois.iis.nu",
	"nameServers": [
		"a.ns.nu",
		"c.ns.nu",
		"d.ns.nu",
		"m.ns.nu",
		"y.ns.nu",
		"z.ns.nu"
	],
	"tags": [
		"country",
		"generic",
		"geo"
	],
	"policies": [
		{
			"type": "idn-table",
			"key": "mul-Latn",
			"value": "https://www.iis.se/docs/nu_teckentabell-01.pdf",
			"comment": "https://www.iis.se/english/domains/nu/idn/"
		},
		{
			"type": "idn-table",
			"key": "und-Latn",
			"value": "https://www.iana.org/domains/idn-tables/tables/nu_und-latn_2.xml"
		}
	]
}
