{
	"domain": "travel",
	"infoURL": "https://www.travel.domains/",
	"whoisServer": "whois.nic.travel",
	"rdapURLs": [
		"https://rdap.nic.travel/"
	],
	"nameServers": [
		"demand.alpha.aridns.net.au",
		"demand.beta.aridns.net.au",
		"demand.delta.aridns.net.au",
		"demand.gamma.aridns.net.au"
	],
	"tags": [
		"generic",
		"sponsored"
	],
	"policies": [
		{
			"type": "idn-disallowed"
		}
	]
}
