{
	"domain": "aco",
	"infoURL": "https://newgtlds.icann.org/",
	"whoisServer": "whois.nic.aco",
	"rdapURLs": [
		"https://rdap.nic.aco/"
	],
	"nameServers": [
		"a.dns.nic.aco",
		"m.dns.nic.aco",
		"n.dns.nic.aco"
	],
	"tags": [
		"brand",
		"generic"
	],
	"policies": [
		{
			"type": "idn-table",
			"key": "be",
			"value": "https://www.iana.org/domains/idn-tables/tables/aco_be_1.0.txt"
		},
		{
			"type": "idn-table",
			"key": "bg",
			"value": "https://www.iana.org/domains/idn-tables/tables/aco_bg_1.0.txt"
		},
		{
			"type": "idn-table",
			"key": "bs",
			"value": "https://www.iana.org/domains/idn-tables/tables/aco_bs_1.0.txt"
		},
		{
			"type": "idn-table",
			"key": "da",
			"value": "https://www.iana.org/domains/idn-tables/tables/aco_da_1.0.txt"
		},
		{
			"type": "idn-table",
			"key": "de",
			"value": "https://www.iana.org/domains/idn-tables/tables/aco_de_1.0.txt"
		},
		{
			"type": "idn-table",
			"key": "es",
			"value": "https://www.iana.org/domains/idn-tables/tables/aco_es_1.0.txt"
		},
		{
			"type": "idn-table",
			"key": "hu",
			"value": "https://www.iana.org/domains/idn-tables/tables/aco_hu_1.0.txt"
		},
		{
			"type": "idn-table",
			"key": "is",
			"value": "https://www.iana.org/domains/idn-tables/tables/aco_is_1.0.txt"
		},
		{
			"type": "idn-table",
			"key": "ko",
			"value": "https://www.iana.org/domains/idn-tables/tables/aco_ko_1.0.txt"
		},
		{
			"type": "idn-table",
			"key": "lt",
			"value": "https://www.iana.org/domains/idn-tables/tables/aco_lt_1.0.txt"
		},
		{
			"type": "idn-table",
			"key": "lv",
			"value": "https://www.iana.org/domains/idn-tables/tables/aco_lv_1.0.txt"
		},
		{
			"type": "idn-table",
			"key": "mk",
			"value": "https://www.iana.org/domains/idn-tables/tables/aco_mk_1.0.txt"
		},
		{
			"type": "idn-table",
			"key": "pl",
			"value": "https://www.iana.org/domains/idn-tables/tables/aco_pl_1.0.txt"
		},
		{
			"type": "idn-table",
			"key": "ru",
			"value": "https://www.iana.org/domains/idn-tables/tables/aco_ru_1.0.txt"
		},
		{
			"type": "idn-table",
			"key": "sr",
			"value": "https://www.iana.org/domains/idn-tables/tables/aco_sr_1.0.txt"
		},
		{
			"type": "idn-table",
			"key": "sr-ME",
			"value": "https://www.iana.org/domains/idn-tables/tables/aco_sr-me_1.0.txt"
		},
		{
			"type": "idn-table",
			"key": "sv",
			"value": "https://www.iana.org/domains/idn-tables/tables/aco_sv_1.0.txt"
		},
		{
			"type": "idn-table",
			"key": "uk",
			"value": "https://www.iana.org/domains/idn-tables/tables/aco_uk_1.0.txt"
		},
		{
			"type": "idn-table",
			"key": "zh-CN",
			"value": "https://www.iana.org/domains/idn-tables/tables/aco_zh-cn_4.0.txt"
		},
		{
			"type": "idn-table",
			"key": "zh-TW",
			"value": "https://www.iana.org/domains/idn-tables/tables/aco_zh-tw_4.0.txt"
		}
	]
}
