{
	"domain": "عمان",
	"infoURL": "https://newgtlds.icann.org/",
	"whoisServer": "whois.registry.om",
	"nameServers": [
		"cctld.alpha.aridns.net.au",
		"cctld.beta.aridns.net.au",
		"cctld.delta.aridns.net.au",
		"cctld.gamma.aridns.net.au",
		"ns1.registry.om",
		"ns2.registry.om"
	],
	"tags": [
		"generic"
	]
}
