{
	"domain": "biz.uz",
	"nameServers": [
		"ns1.subdomain.com",
		"ns2.subdomain.com"
	],
	"wildcards": [
		"144.76.162.245",
		"biz.uz"
	],
	"tags": [
		"private"
	],
	"policies": [
		{
			"type": "idn-disallowed"
		}
	]
}
