{
	"domain": "koeln",
	"whoisServer": "whois.ryce-rsp.com",
	"rdapURLs": [
		"https://rdap.ryce-rsp.com/rdap/"
	],
	"nameServers": [
		"dns.ryce-rsp.com",
		"ns1.dns.business",
		"ns1.ryce-rsp.com"
	],
	"locations": [
		"Cologne",
		"Koeln"
	],
	"tags": [
		"city",
		"generic",
		"geo"
	],
	"policies": [
		{
			"type": "idn-table",
			"key": "de",
			"value": "https://www.iana.org/domains/idn-tables/tables/koeln_de_1.0.txt"
		},
		{
			"type": "idn-table",
			"key": "mul-Latn",
			"value": "https://www.iana.org/domains/idn-tables/tables/koeln_latn_1.0.txt"
		}
	]
}
