{
	"domain": "makeup",
	"infoURL": "https://newgtlds.icann.org/",
	"whoisServer": "whois.nic.makeup",
	"rdapURLs": [
		"https://rdap.centralnic.com/makeup/"
	],
	"nameServers": [
		"a.nic.makeup",
		"b.nic.makeup",
		"c.nic.makeup",
		"d.nic.makeup"
	],
	"tags": [
		"brand",
		"generic"
	],
	"policies": [
		{
			"type": "idn-disallowed"
		}
	]
}
