{
	"domain": "aquarelle",
	"infoURL": "https://newgtlds.icann.org/",
	"whoisServer": "whois.nic.aquarelle",
	"rdapURLs": [
		"https://rdap.nic.aquarelle/"
	],
	"nameServers": [
		"d.nic.fr",
		"f.ext.nic.fr",
		"g.ext.nic.fr"
	],
	"tags": [
		"brand",
		"generic"
	],
	"policies": [
		{
			"type": "idn-table",
			"key": "mul-Latn",
			"value": "https://www.iana.org/domains/idn-tables/tables/aquarelle_latn_1.txt"
		}
	]
}
