{
	"domain": "nokia",
	"infoURL": "https://newgtlds.icann.org/",
	"whoisServer": "whois.afilias-srs.net",
	"rdapURLs": [
		"https://rdap.afilias-srs.net/rdap/nokia/"
	],
	"nameServers": [
		"a0.nic.nokia",
		"a2.nic.nokia",
		"b0.nic.nokia",
		"c0.nic.nokia"
	],
	"tags": [
		"brand",
		"generic"
	],
	"policies": [
		{
			"type": "idn-table",
			"key": "be",
			"value": "https://www.iana.org/domains/idn-tables/tables/nokia_be_1.txt"
		},
		{
			"type": "idn-table",
			"key": "bg",
			"value": "https://www.iana.org/domains/idn-tables/tables/nokia_bg_1.txt"
		},
		{
			"type": "idn-table",
			"key": "bs",
			"value": "https://www.iana.org/domains/idn-tables/tables/nokia_bs_1.txt"
		},
		{
			"type": "idn-table",
			"key": "da",
			"value": "https://www.iana.org/domains/idn-tables/tables/nokia_da_1.txt"
		},
		{
			"type": "idn-table",
			"key": "de",
			"value": "https://www.iana.org/domains/idn-tables/tables/nokia_de_1.txt"
		},
		{
			"type": "idn-table",
			"key": "es",
			"value": "https://www.iana.org/domains/idn-tables/tables/nokia_es_1.txt"
		},
		{
			"type": "idn-table",
			"key": "hu",
			"value": "https://www.iana.org/domains/idn-tables/tables/nokia_hu_1.txt"
		},
		{
			"type": "idn-table",
			"key": "is",
			"value": "https://www.iana.org/domains/idn-tables/tables/nokia_is_1.txt"
		},
		{
			"type": "idn-table",
			"key": "ko",
			"value": "https://www.iana.org/domains/idn-tables/tables/nokia_ko_1.txt"
		},
		{
			"type": "idn-table",
			"key": "lt",
			"value": "https://www.iana.org/domains/idn-tables/tables/nokia_lt_1.txt"
		},
		{
			"type": "idn-table",
			"key": "lv",
			"value": "https://www.iana.org/domains/idn-tables/tables/nokia_lv_1.txt"
		},
		{
			"type": "idn-table",
			"key": "mis",
			"value": "https://www.iana.org/domains/idn-tables/tables/nokia_mis_1.txt"
		},
		{
			"type": "idn-table",
			"key": "mk",
			"value": "https://www.iana.org/domains/idn-tables/tables/nokia_mk_1.txt"
		},
		{
			"type": "idn-table",
			"key": "pl",
			"value": "https://www.iana.org/domains/idn-tables/tables/nokia_pl_1.txt"
		},
		{
			"type": "idn-table",
			"key": "ru",
			"value": "https://www.iana.org/domains/idn-tables/tables/nokia_ru_1.txt"
		},
		{
			"type": "idn-table",
			"key": "sr",
			"value": "https://www.iana.org/domains/idn-tables/tables/nokia_sr_1.txt"
		},
		{
			"type": "idn-table",
			"key": "sr-ME",
			"value": "https://www.iana.org/domains/idn-tables/tables/nokia_sr-me_1.txt"
		},
		{
			"type": "idn-table",
			"key": "sv",
			"value": "https://www.iana.org/domains/idn-tables/tables/nokia_sv_1.txt"
		},
		{
			"type": "idn-table",
			"key": "uk",
			"value": "https://www.iana.org/domains/idn-tables/tables/nokia_uk_1.txt"
		},
		{
			"type": "idn-table",
			"key": "zh-CN",
			"value": "https://www.iana.org/domains/idn-tables/tables/nokia_zh-cn_4.0.txt"
		},
		{
			"type": "idn-table",
			"key": "zh-TW",
			"value": "https://www.iana.org/domains/idn-tables/tables/nokia_zh-tw_4.0.txt"
		}
	]
}
