{
	"domain": "संगठन",
	"infoURL": "https://pir.org/products/hindi-domain/",
	"whoisServer": "whois.publicinterestregistry.net",
	"rdapURLs": [
		"https://rdap.publicinterestregistry.net/rdap/xn--i1b6b1a6a2e/"
	],
	"nameServers": [
		"a0.nic.संगठन",
		"a2.nic.संगठन",
		"b0.nic.संगठन",
		"c0.nic.संगठन"
	],
	"tags": [
		"generic"
	],
	"policies": [
		{
			"type": "idn-table",
			"key": "hi",
			"value": "https://www.iana.org/domains/idn-tables/tables/xn--i1b6b1a6a2e_hi_1.txt"
		}
	]
}
