{
	"domain": "py",
	"whoisURL": "http://www.nic.py/consulta-datos.php",
	"nameServers": [
		"b.dns.py",
		"c.dns.py",
		"l.dns.py",
		"m.dns.py",
		"p.dns.py",
		"u.dns.py"
	],
	"tags": [
		"closed",
		"country",
		"geo"
	],
	"policies": [
		{
			"type": "idn-disallowed"
		}
	]
}
