{
	"domain": "stream",
	"infoURL": "https://www.famousfourmedia.com/",
	"whoisServer": "whois.nic.stream",
	"rdapURLs": [
		"https://rdap.nic.stream/"
	],
	"nameServers": [
		"ns1.dns.nic.stream",
		"ns2.dns.nic.stream",
		"ns3.dns.nic.stream",
		"ns4.dns.nic.stream",
		"ns5.dns.nic.stream",
		"ns6.dns.nic.stream"
	],
	"tags": [
		"generic"
	],
	"policies": [
		{
			"type": "idn-table",
			"key": "da",
			"value": "https://www.iana.org/domains/idn-tables/tables/stream_da_3.0.xml"
		},
		{
			"type": "idn-table",
			"key": "de",
			"value": "https://www.iana.org/domains/idn-tables/tables/stream_de_3.0.xml"
		},
		{
			"type": "idn-table",
			"key": "no",
			"value": "https://www.iana.org/domains/idn-tables/tables/stream_no_3.0.xml"
		},
		{
			"type": "idn-table",
			"key": "sv",
			"value": "https://www.iana.org/domains/idn-tables/tables/stream_sv_3.0.xml"
		}
	]
}
