{
	"domain": "bio",
	"infoURL": "https://domains.bio/",
	"whoisServer": "whois.afilias.net",
	"rdapURLs": [
		"https://rdap.afilias.net/rdap/bio/"
	],
	"nameServers": [
		"a0.nic.bio",
		"a2.nic.bio",
		"b0.nic.bio",
		"c0.nic.bio"
	],
	"tags": [
		"generic"
	],
	"policies": [
		{
			"type": "idn-table",
			"key": "de",
			"value": "https://www.iana.org/domains/idn-tables/tables/bio_de_1.txt"
		}
	]
}
