{
	"domain": "cy",
	"whoisURL": "http://www.nic.cy/nslookup/online_database.php",
	"nameServers": [
		"cy-ns.anycast.pch.net",
		"cynic.dns.cy",
		"cynic4.dns.cy",
		"cynic6.dns.cy",
		"estia.ics.forth.gr",
		"ns02.savvis.net",
		"ns31.rcode0.net",
		"ns4.apnic.net"
	],
	"tags": [
		"closed",
		"country",
		"geo"
	],
	"policies": [
		{
			"type": "idn-disallowed"
		}
	]
}
