{
	"domain": "weather",
	"infoURL": "https://newgtlds.icann.org/",
	"whoisServer": "whois.nic.weather",
	"rdapURLs": [
		"https://rdap.nic.weather/"
	],
	"nameServers": [
		"ns1.dns.nic.weather",
		"ns2.dns.nic.weather",
		"ns3.dns.nic.weather",
		"ns4.dns.nic.weather",
		"ns5.dns.nic.weather",
		"ns6.dns.nic.weather"
	],
	"tags": [
		"generic"
	],
	"policies": [
		{
			"type": "idn-table",
			"key": "da",
			"value": "https://www.iana.org/domains/idn-tables/tables/weather_da_3.0.xml"
		},
		{
			"type": "idn-table",
			"key": "de",
			"value": "https://www.iana.org/domains/idn-tables/tables/weather_de_3.0.xml"
		},
		{
			"type": "idn-table",
			"key": "es",
			"value": "https://www.iana.org/domains/idn-tables/tables/weather_es_3.0.xml"
		},
		{
			"type": "idn-table",
			"key": "fi",
			"value": "https://www.iana.org/domains/idn-tables/tables/weather_fi_3.0.xml"
		},
		{
			"type": "idn-table",
			"key": "hu",
			"value": "https://www.iana.org/domains/idn-tables/tables/weather_hu_3.0.xml"
		},
		{
			"type": "idn-table",
			"key": "is",
			"value": "https://www.iana.org/domains/idn-tables/tables/weather_is_3.0.xml"
		},
		{
			"type": "idn-table",
			"key": "ja",
			"value": "https://www.iana.org/domains/idn-tables/tables/weather_ja_3.0.xml"
		},
		{
			"type": "idn-table",
			"key": "ko",
			"value": "https://www.iana.org/domains/idn-tables/tables/weather_ko_3.0.xml"
		},
		{
			"type": "idn-table",
			"key": "lt",
			"value": "https://www.iana.org/domains/idn-tables/tables/weather_lt_3.0.xml"
		},
		{
			"type": "idn-table",
			"key": "lv",
			"value": "https://www.iana.org/domains/idn-tables/tables/weather_lv_3.0.xml"
		},
		{
			"type": "idn-table",
			"key": "no",
			"value": "https://www.iana.org/domains/idn-tables/tables/weather_no_3.0.xml"
		},
		{
			"type": "idn-table",
			"key": "pl",
			"value": "https://www.iana.org/domains/idn-tables/tables/weather_pl_3.0.xml"
		},
		{
			"type": "idn-table",
			"key": "pt",
			"value": "https://www.iana.org/domains/idn-tables/tables/weather_pt_3.0.xml"
		},
		{
			"type": "idn-table",
			"key": "ru",
			"value": "https://www.iana.org/domains/idn-tables/tables/weather_ru_3.0.xml"
		},
		{
			"type": "idn-table",
			"key": "sv",
			"value": "https://www.iana.org/domains/idn-tables/tables/weather_sv_3.0.xml"
		},
		{
			"type": "idn-table",
			"key": "zh",
			"value": "https://www.iana.org/domains/idn-tables/tables/weather_zh_3.0.xml"
		}
	]
}
