{
	"domain": "рф",
	"infoURL": "https://cctld.ru/",
	"whoisServer": "whois.tcinet.ru",
	"nameServers": [
		"a.dns.ripn.net",
		"b.dns.ripn.net",
		"d.dns.ripn.net",
		"e.dns.ripn.net",
		"f.dns.ripn.net"
	],
	"languages": [
		"ru-RU"
	],
	"tags": [
		"country",
		"geo"
	],
	"policies": [
		{
			"type": "idn-table",
			"comment": "https://cctld.ru/en/docs/rulesrf.php"
		}
	]
}
