{
	"domain": "art",
	"infoURL": "https://newgtlds.icann.org/",
	"whoisServer": "whois.nic.art",
	"rdapURLs": [
		"https://rdap.centralnic.com/art/"
	],
	"nameServers": [
		"a.nic.art",
		"b.nic.art",
		"c.nic.art",
		"d.nic.art"
	],
	"tags": [
		"generic"
	],
	"policies": [
		{
			"type": "idn-table",
			"key": "ar",
			"value": "https://www.iana.org/domains/idn-tables/tables/art_ar_1.1.txt"
		},
		{
			"type": "idn-table",
			"key": "da",
			"value": "https://www.iana.org/domains/idn-tables/tables/art_da_1.1.txt"
		},
		{
			"type": "idn-table",
			"key": "he",
			"value": "https://www.iana.org/domains/idn-tables/tables/art_he_1.0.txt"
		},
		{
			"type": "idn-table",
			"key": "ja",
			"value": "https://www.iana.org/domains/idn-tables/tables/art_ja_1.0.txt"
		},
		{
			"type": "idn-table",
			"key": "ko",
			"value": "https://www.iana.org/domains/idn-tables/tables/art_ko_1.0.txt"
		},
		{
			"type": "idn-table",
			"key": "lo",
			"value": "https://www.iana.org/domains/idn-tables/tables/art_lo_2.0.txt"
		},
		{
			"type": "idn-table",
			"key": "mul-Cyrl",
			"value": "https://www.iana.org/domains/idn-tables/tables/art_cyrl_1.1.txt"
		},
		{
			"type": "idn-table",
			"key": "mul-Grek",
			"value": "https://www.iana.org/domains/idn-tables/tables/art_grek_1.1.txt"
		},
		{
			"type": "idn-table",
			"key": "mul-Latn",
			"value": "https://www.iana.org/domains/idn-tables/tables/art_latn_1.0.txt"
		},
		{
			"type": "idn-table",
			"key": "mul-Mymr",
			"value": "https://www.iana.org/domains/idn-tables/tables/art_mymr_2.0.txt"
		},
		{
			"type": "idn-table",
			"key": "pl",
			"value": "https://www.iana.org/domains/idn-tables/tables/art_pl_1.0.txt"
		},
		{
			"type": "idn-table",
			"key": "ru",
			"value": "https://www.iana.org/domains/idn-tables/tables/art_ru_1.0.txt"
		},
		{
			"type": "idn-table",
			"key": "sv",
			"value": "https://www.iana.org/domains/idn-tables/tables/art_sv_1.1.txt"
		},
		{
			"type": "idn-table",
			"key": "th",
			"value": "https://www.iana.org/domains/idn-tables/tables/art_th_2.0.txt"
		}
	]
}
