{
	"domain": "shop",
	"infoURL": "https://newgtlds.icann.org/",
	"whoisServer": "whois.nic.shop",
	"rdapURLs": [
		"https://rdap.gmoregistry.net/rdap/"
	],
	"nameServers": [
		"a.gmoregistry.net",
		"b.gmoregistry.net",
		"k.gmoregistry.net",
		"l.gmoregistry.net"
	],
	"tags": [
		"generic"
	],
	"policies": [
		{
			"type": "idn-table",
			"key": "ar",
			"value": "https://www.iana.org/domains/idn-tables/tables/shop_ar_1.0.txt"
		},
		{
			"type": "idn-table",
			"key": "de",
			"value": "https://www.iana.org/domains/idn-tables/tables/shop_de_1.0.txt"
		},
		{
			"type": "idn-table",
			"key": "es",
			"value": "https://www.iana.org/domains/idn-tables/tables/shop_es_1.0.txt"
		},
		{
			"type": "idn-table",
			"key": "fr",
			"value": "https://www.iana.org/domains/idn-tables/tables/shop_fr_1.0.txt"
		},
		{
			"type": "idn-table",
			"key": "ja",
			"value": "https://www.iana.org/domains/idn-tables/tables/shop_ja_1.0.txt"
		},
		{
			"type": "idn-table",
			"key": "ko",
			"value": "https://www.iana.org/domains/idn-tables/tables/shop_ko_1.0.txt"
		},
		{
			"type": "idn-table",
			"key": "nl",
			"value": "https://www.iana.org/domains/idn-tables/tables/shop_nl_1.0.txt"
		},
		{
			"type": "idn-table",
			"key": "pl",
			"value": "https://www.iana.org/domains/idn-tables/tables/shop_pl_1.0.txt"
		},
		{
			"type": "idn-table",
			"key": "pt",
			"value": "https://www.iana.org/domains/idn-tables/tables/shop_pt_1.0.txt"
		},
		{
			"type": "idn-table",
			"key": "ru",
			"value": "https://www.iana.org/domains/idn-tables/tables/shop_ru_1.0.txt"
		},
		{
			"type": "idn-table",
			"key": "tr",
			"value": "https://www.iana.org/domains/idn-tables/tables/shop_tr_1.0.txt"
		},
		{
			"type": "idn-table",
			"key": "zh",
			"value": "https://www.iana.org/domains/idn-tables/tables/shop_zh_1.1.txt"
		}
	]
}
