{
	"domain": "party",
	"infoURL": "https://www.famousfourmedia.com/",
	"whoisServer": "whois.nic.party",
	"rdapURLs": [
		"https://rdap.nic.party/"
	],
	"nameServers": [
		"ns1.dns.nic.party",
		"ns2.dns.nic.party",
		"ns3.dns.nic.party",
		"ns4.dns.nic.party",
		"ns5.dns.nic.party",
		"ns6.dns.nic.party"
	],
	"tags": [
		"generic"
	],
	"policies": [
		{
			"type": "idn-table",
			"key": "da",
			"value": "https://www.iana.org/domains/idn-tables/tables/party_da_3.0.xml"
		},
		{
			"type": "idn-table",
			"key": "de",
			"value": "https://www.iana.org/domains/idn-tables/tables/party_de_3.0.xml"
		},
		{
			"type": "idn-table",
			"key": "es",
			"value": "https://www.iana.org/domains/idn-tables/tables/party_es_3.0.xml"
		},
		{
			"type": "idn-table",
			"key": "fi",
			"value": "https://www.iana.org/domains/idn-tables/tables/party_fi_3.0.xml"
		},
		{
			"type": "idn-table",
			"key": "fr",
			"value": "https://www.iana.org/domains/idn-tables/tables/party_fr_3.0.xml"
		},
		{
			"type": "idn-table",
			"key": "hu",
			"value": "https://www.iana.org/domains/idn-tables/tables/party_hu_3.0.xml"
		},
		{
			"type": "idn-table",
			"key": "is",
			"value": "https://www.iana.org/domains/idn-tables/tables/party_is_3.0.xml"
		},
		{
			"type": "idn-table",
			"key": "ja",
			"value": "https://www.iana.org/domains/idn-tables/tables/party_ja_3.0.xml"
		},
		{
			"type": "idn-table",
			"key": "ko",
			"value": "https://www.iana.org/domains/idn-tables/tables/party_ko_3.0.xml"
		},
		{
			"type": "idn-table",
			"key": "lt",
			"value": "https://www.iana.org/domains/idn-tables/tables/party_lt_3.0.xml"
		},
		{
			"type": "idn-table",
			"key": "lv",
			"value": "https://www.iana.org/domains/idn-tables/tables/party_lv_3.0.xml"
		},
		{
			"type": "idn-table",
			"key": "no",
			"value": "https://www.iana.org/domains/idn-tables/tables/party_no_3.0.xml"
		},
		{
			"type": "idn-table",
			"key": "pl",
			"value": "https://www.iana.org/domains/idn-tables/tables/party_pl_3.0.xml"
		},
		{
			"type": "idn-table",
			"key": "pt",
			"value": "https://www.iana.org/domains/idn-tables/tables/party_pt_3.0.xml"
		},
		{
			"type": "idn-table",
			"key": "ru",
			"value": "https://www.iana.org/domains/idn-tables/tables/party_ru_3.0.xml"
		},
		{
			"type": "idn-table",
			"key": "sv",
			"value": "https://www.iana.org/domains/idn-tables/tables/party_sv_3.0.xml"
		},
		{
			"type": "idn-table",
			"key": "zh",
			"value": "https://www.iana.org/domains/idn-tables/tables/party_zh_3.0.xml"
		}
	]
}
