{
	"domain": "goldpoint",
	"infoURL": "https://newgtlds.icann.org/",
	"whoisServer": "whois.nic.goldpoint",
	"rdapURLs": [
		"https://rdap.gmoregistry.net/rdap/"
	],
	"nameServers": [
		"a.gmoregistry.net",
		"b.gmoregistry.net",
		"k.gmoregistry.net",
		"l.gmoregistry.net"
	],
	"tags": [
		"brand",
		"generic"
	],
	"policies": [
		{
			"type": "idn-table",
			"key": "ja",
			"value": "https://www.iana.org/domains/idn-tables/tables/goldpoint_ja_1.0.txt"
		}
	]
}
