{
	"domain": "site",
	"infoURL": "https://newgtlds.icann.org/",
	"whoisServer": "whois.nic.site",
	"rdapURLs": [
		"https://rdap.centralnic.com/site/"
	],
	"nameServers": [
		"a.nic.site",
		"b.nic.site",
		"e.nic.site",
		"f.nic.site"
	],
	"tags": [
		"generic"
	],
	"policies": [
		{
			"type": "idn-table",
			"key": "ar",
			"value": "https://www.iana.org/domains/idn-tables/tables/site_ar_1.1.txt"
		},
		{
			"type": "idn-table",
			"key": "he",
			"value": "https://www.iana.org/domains/idn-tables/tables/site_he_1.0.txt"
		},
		{
			"type": "idn-table",
			"key": "ja",
			"value": "https://www.iana.org/domains/idn-tables/tables/site_ja_1.0.txt"
		},
		{
			"type": "idn-table",
			"key": "ko",
			"value": "https://www.iana.org/domains/idn-tables/tables/site_ko_1.0.txt"
		},
		{
			"type": "idn-table",
			"key": "lo",
			"value": "https://www.iana.org/domains/idn-tables/tables/site_lo_2.0.txt"
		},
		{
			"type": "idn-table",
			"key": "mul-Cyrl",
			"value": "https://www.iana.org/domains/idn-tables/tables/site_cyrl_1.1.txt"
		},
		{
			"type": "idn-table",
			"key": "mul-Grek",
			"value": "https://www.iana.org/domains/idn-tables/tables/site_grek_1.1.txt"
		},
		{
			"type": "idn-table",
			"key": "mul-Latn",
			"value": "https://www.iana.org/domains/idn-tables/tables/site_latn_1.0.txt"
		},
		{
			"type": "idn-table",
			"key": "th",
			"value": "https://www.iana.org/domains/idn-tables/tables/site_th_2.0.txt"
		},
		{
			"type": "idn-table",
			"key": "zh",
			"value": "https://www.iana.org/domains/idn-tables/tables/site_zh_1.0.txt"
		}
	]
}
