{
	"domain": "삼성",
	"infoURL": "https://newgtlds.icann.org/",
	"whoisServer": "whois.kr",
	"rdapURLs": [
		"https://nic.samsung:8443/rdap/"
	],
	"nameServers": [
		"ns1.삼성.centralnic-dns.com",
		"ns2.삼성.centralnic-dns.com",
		"ns3.삼성.centralnic-dns.com",
		"ns4.삼성.centralnic-dns.com"
	],
	"tags": [
		"brand",
		"generic"
	],
	"policies": [
		{
			"type": "idn-table",
			"key": "ko",
			"value": "https://www.iana.org/domains/idn-tables/tables/xn--cg4bki_ko_1.0.txt"
		}
	]
}
