{
	"domain": "tickets",
	"infoURL": "https://newgtlds.icann.org/",
	"whoisServer": "whois.nic.tickets",
	"rdapURLs": [
		"https://rdap.centralnic.com/tickets/"
	],
	"nameServers": [
		"a.nic.tickets",
		"b.nic.tickets",
		"c.nic.tickets",
		"d.nic.tickets"
	],
	"tags": [
		"generic"
	],
	"policies": [
		{
			"type": "idn-table",
			"key": "da",
			"value": "https://www.iana.org/domains/idn-tables/tables/tickets_da_1.1.txt"
		},
		{
			"type": "idn-table",
			"key": "de",
			"value": "https://www.iana.org/domains/idn-tables/tables/tickets_de_1.0.txt"
		},
		{
			"type": "idn-table",
			"key": "es",
			"value": "https://www.iana.org/domains/idn-tables/tables/tickets_es_1.0.txt"
		},
		{
			"type": "idn-table",
			"key": "pl",
			"value": "https://www.iana.org/domains/idn-tables/tables/tickets_pl_1.0.txt"
		},
		{
			"type": "idn-table",
			"key": "sv",
			"value": "https://www.iana.org/domains/idn-tables/tables/tickets_sv_1.1.txt"
		}
	]
}
