{
	"domain": "olayangroup",
	"infoURL": "https://newgtlds.icann.org/",
	"whoisServer": "whois.nic.olayangroup",
	"rdapURLs": [
		"https://rdap.nic.olayangroup/"
	],
	"nameServers": [
		"a.nic.olayangroup",
		"b.nic.olayangroup",
		"c.nic.olayangroup",
		"d.nic.olayangroup"
	],
	"tags": [
		"brand",
		"generic"
	],
	"policies": [
		{
			"type": "idn-table",
			"key": "ar",
			"value": "https://www.iana.org/domains/idn-tables/tables/olayangroup_ar_3.0.xml"
		}
	]
}
