{
	"domain": "audi",
	"infoURL": "https://newgtlds.icann.org/",
	"whoisServer": "whois.afilias-srs.net",
	"rdapURLs": [
		"https://rdap.afilias-srs.net/rdap/audi/"
	],
	"nameServers": [
		"a0.nic.audi",
		"a2.nic.audi",
		"b0.nic.audi",
		"c0.nic.audi"
	],
	"tags": [
		"brand",
		"generic"
	],
	"policies": [
		{
			"type": "idn-table",
			"key": "be",
			"value": "https://www.iana.org/domains/idn-tables/tables/audi_be_1.txt"
		},
		{
			"type": "idn-table",
			"key": "bg",
			"value": "https://www.iana.org/domains/idn-tables/tables/audi_bg_1.txt"
		},
		{
			"type": "idn-table",
			"key": "bs",
			"value": "https://www.iana.org/domains/idn-tables/tables/audi_bs_1.txt"
		},
		{
			"type": "idn-table",
			"key": "da",
			"value": "https://www.iana.org/domains/idn-tables/tables/audi_da_1.txt"
		},
		{
			"type": "idn-table",
			"key": "de",
			"value": "https://www.iana.org/domains/idn-tables/tables/audi_de_1.txt"
		},
		{
			"type": "idn-table",
			"key": "es",
			"value": "https://www.iana.org/domains/idn-tables/tables/audi_es_1.txt"
		},
		{
			"type": "idn-table",
			"key": "hu",
			"value": "https://www.iana.org/domains/idn-tables/tables/audi_hu_1.txt"
		},
		{
			"type": "idn-table",
			"key": "is",
			"value": "https://www.iana.org/domains/idn-tables/tables/audi_is_1.txt"
		},
		{
			"type": "idn-table",
			"key": "ko",
			"value": "https://www.iana.org/domains/idn-tables/tables/audi_ko_1.txt"
		},
		{
			"type": "idn-table",
			"key": "lt",
			"value": "https://www.iana.org/domains/idn-tables/tables/audi_lt_1.txt"
		},
		{
			"type": "idn-table",
			"key": "lv",
			"value": "https://www.iana.org/domains/idn-tables/tables/audi_lv_1.txt"
		},
		{
			"type": "idn-table",
			"key": "mk",
			"value": "https://www.iana.org/domains/idn-tables/tables/audi_mk_1.txt"
		},
		{
			"type": "idn-table",
			"key": "pl",
			"value": "https://www.iana.org/domains/idn-tables/tables/audi_pl_1.txt"
		},
		{
			"type": "idn-table",
			"key": "ru",
			"value": "https://www.iana.org/domains/idn-tables/tables/audi_ru_1.txt"
		},
		{
			"type": "idn-table",
			"key": "sr",
			"value": "https://www.iana.org/domains/idn-tables/tables/audi_sr_1.txt"
		},
		{
			"type": "idn-table",
			"key": "sr-ME",
			"value": "https://www.iana.org/domains/idn-tables/tables/audi_sr-me_1.txt"
		},
		{
			"type": "idn-table",
			"key": "sv",
			"value": "https://www.iana.org/domains/idn-tables/tables/audi_sv_1.txt"
		},
		{
			"type": "idn-table",
			"key": "uk",
			"value": "https://www.iana.org/domains/idn-tables/tables/audi_uk_1.txt"
		},
		{
			"type": "idn-table",
			"key": "zh-Hans",
			"value": "https://www.iana.org/domains/idn-tables/tables/audi_zh-hans_4.0.txt"
		},
		{
			"type": "idn-table",
			"key": "zh-Hant",
			"value": "https://www.iana.org/domains/idn-tables/tables/audi_zh-hant_4.0.txt"
		}
	]
}
