{
	"domain": "br",
	"infoURL": "https://nic.br/",
	"whoisServer": "whois.registro.br",
	"rdapURLs": [
		"https://rdap.registro.br/"
	],
	"nameServers": [
		"a.dns.br",
		"b.dns.br",
		"c.dns.br",
		"d.dns.br",
		"e.dns.br",
		"f.dns.br"
	],
	"tags": [
		"country",
		"geo"
	],
	"policies": [
		{
			"type": "idn-table",
			"key": "pt-BR",
			"value": "https://www.iana.org/domains/idn-tables/tables/br_pt-br_1.0.html",
			"comment": "https://registro.br/dominio/regras.html"
		}
	]
}
