{
	"domain": "walter",
	"infoURL": "https://newgtlds.icann.org/",
	"whoisServer": "whois.nic.walter",
	"rdapURLs": [
		"https://rdap.nic.walter/"
	],
	"nameServers": [
		"a.nic.walter",
		"b.nic.walter",
		"c.nic.walter",
		"d.nic.walter"
	],
	"tags": [
		"brand",
		"generic"
	],
	"policies": [
		{
			"type": "idn-table",
			"key": "da",
			"value": "https://www.iana.org/domains/idn-tables/tables/walter_da_3.0.xml"
		},
		{
			"type": "idn-table",
			"key": "fr",
			"value": "https://www.iana.org/domains/idn-tables/tables/walter_fr_3.0.xml"
		},
		{
			"type": "idn-table",
			"key": "pl",
			"value": "https://www.iana.org/domains/idn-tables/tables/walter_pl_3.0.xml"
		},
		{
			"type": "idn-table",
			"key": "ru",
			"value": "https://www.iana.org/domains/idn-tables/tables/walter_ru_3.0.xml"
		},
		{
			"type": "idn-table",
			"key": "sv",
			"value": "https://www.iana.org/domains/idn-tables/tables/walter_sv_3.0.xml"
		},
		{
			"type": "idn-table",
			"key": "zh",
			"value": "https://www.iana.org/domains/idn-tables/tables/walter_zh_3.0.xml"
		}
	]
}
