module github.com/zonedb/zonedb

require (
	github.com/PuerkitoBio/goquery v1.6.1
	github.com/andybalholm/cascadia v1.2.0 // indirect
	github.com/miekg/dns v1.1.41
	github.com/wsxiaoys/terminal v0.0.0-20160513160801-0940f3fc43a0
	golang.org/x/net v0.0.0-20210226172049-e18ecbb05110
	golang.org/x/text v0.3.6
)

go 1.13
