{
	"domain": "horse",
	"infoURL": "http://nic.horse/",
	"whoisServer": "whois.nic.horse",
	"rdapURLs": [
		"https://rdap.nominet.uk/horse/"
	],
	"nameServers": [
		"dns1.nic.horse",
		"dns2.nic.horse",
		"dns3.nic.horse",
		"dns4.nic.horse",
		"dnsa.nic.horse",
		"dnsb.nic.horse",
		"dnsc.nic.horse",
		"dnsd.nic.horse"
	],
	"tags": [
		"generic"
	],
	"policies": [
		{
			"type": "idn-table",
			"key": "de",
			"value": "https://www.iana.org/domains/idn-tables/tables/horse_de_1.0.txt",
			"comment": "https://registrars.nominet.uk/gtlds/gtld-registrar-systems/internationalised-domain-names-idns"
		},
		{
			"type": "idn-table",
			"key": "es",
			"value": "https://www.iana.org/domains/idn-tables/tables/horse_es_1.0.txt",
			"comment": "https://registrars.nominet.uk/gtlds/gtld-registrar-systems/internationalised-domain-names-idns"
		},
		{
			"type": "idn-table",
			"key": "fr",
			"value": "https://www.iana.org/domains/idn-tables/tables/horse_fr_1.0.txt",
			"comment": "https://registrars.nominet.uk/gtlds/gtld-registrar-systems/internationalised-domain-names-idns"
		}
	]
}
