{
	"domain": "сайт",
	"whoisServer": "whois.nic.сайт",
	"rdapURLs": [
		"https://rdap.nic.сайт/"
	],
	"nameServers": [
		"anycast10.irondns.net",
		"anycast23.irondns.net",
		"anycast24.irondns.net",
		"anycast9.irondns.net"
	],
	"tags": [
		"generic"
	],
	"policies": [
		{
			"type": "idn-table",
			"key": "mul-Cyrl",
			"value": "https://www.iana.org/domains/idn-tables/tables/xn--80aswg_cyrl_1.0.txt"
		}
	]
}
