{
	"domain": "wow",
	"infoURL": "https://newgtlds.icann.org/",
	"whoisServer": "whois.nic.wow",
	"rdapURLs": [
		"https://rdap.nominet.uk/wow/"
	],
	"nameServers": [
		"dns1.nic.wow",
		"dns2.nic.wow",
		"dns3.nic.wow",
		"dns4.nic.wow",
		"dnsa.nic.wow",
		"dnsb.nic.wow",
		"dnsc.nic.wow",
		"dnsd.nic.wow"
	],
	"tags": [
		"generic"
	],
	"policies": [
		{
			"type": "idn-table",
			"key": "ar",
			"value": "https://www.iana.org/domains/idn-tables/tables/wow_ar_2.1.txt"
		},
		{
			"type": "idn-table",
			"key": "da",
			"value": "https://www.iana.org/domains/idn-tables/tables/wow_da_2.1.txt"
		},
		{
			"type": "idn-table",
			"key": "de",
			"value": "https://www.iana.org/domains/idn-tables/tables/wow_de_2.1.txt"
		},
		{
			"type": "idn-table",
			"key": "es",
			"value": "https://www.iana.org/domains/idn-tables/tables/wow_es_2.1.txt"
		},
		{
			"type": "idn-table",
			"key": "fi",
			"value": "https://www.iana.org/domains/idn-tables/tables/wow_fi_2.1.txt"
		},
		{
			"type": "idn-table",
			"key": "fr",
			"value": "https://www.iana.org/domains/idn-tables/tables/wow_fr_2.1.txt"
		},
		{
			"type": "idn-table",
			"key": "hu",
			"value": "https://www.iana.org/domains/idn-tables/tables/wow_hu_2.1.txt"
		},
		{
			"type": "idn-table",
			"key": "is",
			"value": "https://www.iana.org/domains/idn-tables/tables/wow_is_2.1.txt"
		},
		{
			"type": "idn-table",
			"key": "ja",
			"value": "https://www.iana.org/domains/idn-tables/tables/wow_ja_2.1.txt"
		},
		{
			"type": "idn-table",
			"key": "ko",
			"value": "https://www.iana.org/domains/idn-tables/tables/wow_ko_2.1.txt"
		},
		{
			"type": "idn-table",
			"key": "lt",
			"value": "https://www.iana.org/domains/idn-tables/tables/wow_lt_2.1.txt"
		},
		{
			"type": "idn-table",
			"key": "lv",
			"value": "https://www.iana.org/domains/idn-tables/tables/wow_lv_2.1.txt"
		},
		{
			"type": "idn-table",
			"key": "no",
			"value": "https://www.iana.org/domains/idn-tables/tables/wow_no_2.1.txt"
		},
		{
			"type": "idn-table",
			"key": "pl",
			"value": "https://www.iana.org/domains/idn-tables/tables/wow_pl_2.1.txt"
		},
		{
			"type": "idn-table",
			"key": "pt",
			"value": "https://www.iana.org/domains/idn-tables/tables/wow_pt_2.1.txt"
		},
		{
			"type": "idn-table",
			"key": "ru",
			"value": "https://www.iana.org/domains/idn-tables/tables/wow_ru_2.1.txt"
		},
		{
			"type": "idn-table",
			"key": "sv",
			"value": "https://www.iana.org/domains/idn-tables/tables/wow_sv_2.1.txt"
		},
		{
			"type": "idn-table",
			"key": "zh",
			"value": "https://www.iana.org/domains/idn-tables/tables/wow_zh_2.1.txt"
		}
	]
}
