{
	"domain": "accountant",
	"infoURL": "https://www.famousfourmedia.com/",
	"whoisServer": "whois.nic.accountant",
	"rdapURLs": [
		"https://rdap.nic.accountant/"
	],
	"nameServers": [
		"ns1.dns.nic.accountant",
		"ns2.dns.nic.accountant",
		"ns3.dns.nic.accountant",
		"ns4.dns.nic.accountant",
		"ns5.dns.nic.accountant",
		"ns6.dns.nic.accountant"
	],
	"tags": [
		"generic"
	],
	"policies": [
		{
			"type": "idn-table",
			"key": "da",
			"value": "https://www.iana.org/domains/idn-tables/tables/accountant_da_3.0.xml"
		},
		{
			"type": "idn-table",
			"key": "de",
			"value": "https://www.iana.org/domains/idn-tables/tables/accountant_de_3.0.xml"
		},
		{
			"type": "idn-table",
			"key": "es",
			"value": "https://www.iana.org/domains/idn-tables/tables/accountant_es_3.0.xml"
		},
		{
			"type": "idn-table",
			"key": "fi",
			"value": "https://www.iana.org/domains/idn-tables/tables/accountant_fi_3.0.xml"
		},
		{
			"type": "idn-table",
			"key": "fr",
			"value": "https://www.iana.org/domains/idn-tables/tables/accountant_fr_3.0.xml"
		},
		{
			"type": "idn-table",
			"key": "hu",
			"value": "https://www.iana.org/domains/idn-tables/tables/accountant_hu_3.0.xml"
		},
		{
			"type": "idn-table",
			"key": "is",
			"value": "https://www.iana.org/domains/idn-tables/tables/accountant_is_3.0.xml"
		},
		{
			"type": "idn-table",
			"key": "ja",
			"value": "https://www.iana.org/domains/idn-tables/tables/accountant_ja_3.0.xml"
		},
		{
			"type": "idn-table",
			"key": "ko",
			"value": "https://www.iana.org/domains/idn-tables/tables/accountant_ko_3.0.xml"
		},
		{
			"type": "idn-table",
			"key": "lt",
			"value": "https://www.iana.org/domains/idn-tables/tables/accountant_lt_3.0.xml"
		},
		{
			"type": "idn-table",
			"key": "lv",
			"value": "https://www.iana.org/domains/idn-tables/tables/accountant_lv_3.0.xml"
		},
		{
			"type": "idn-table",
			"key": "no",
			"value": "https://www.iana.org/domains/idn-tables/tables/accountant_no_3.0.xml"
		},
		{
			"type": "idn-table",
			"key": "pl",
			"value": "https://www.iana.org/domains/idn-tables/tables/accountant_pl_3.0.xml"
		},
		{
			"type": "idn-table",
			"key": "pt",
			"value": "https://www.iana.org/domains/idn-tables/tables/accountant_pt_3.0.xml"
		},
		{
			"type": "idn-table",
			"key": "ru",
			"value": "https://www.iana.org/domains/idn-tables/tables/accountant_ru_3.0.xml"
		},
		{
			"type": "idn-table",
			"key": "sv",
			"value": "https://www.iana.org/domains/idn-tables/tables/accountant_sv_3.0.xml"
		},
		{
			"type": "idn-table",
			"key": "zh",
			"value": "https://www.iana.org/domains/idn-tables/tables/accountant_zh_3.0.xml"
		}
	]
}
