{
	"domain": "uk.com",
	"whoisServer": "whois.centralnic.com",
	"rdapURLs": [
		"https://rdap.centralnic.com/uk.com/"
	],
	"nameServers": [
		"ns1.centralnic.net",
		"ns2.centralnic.net",
		"ns3.centralnic.net",
		"ns4.centralnic.net"
	],
	"wildcards": [
		"54.153.56.183",
		"uk.com"
	],
	"tags": [
		"private"
	]
}
