{
	"domain": "中国",
	"infoURL": "http://cnnic.cn/",
	"whoisServer": "cwhois.cnnic.cn",
	"nameServers": [
		"h.dns.cn",
		"i.dns.cn",
		"j.dns.cn",
		"k.dns.cn",
		"l.dns.cn",
		"m.dns.cn",
		"n.dns.cn"
	],
	"wildcards": [
		"218.241.116.40"
	],
	"languages": [
		"zh-Hans-CN"
	]
}
