{
	"domain": "ing",
	"infoURL": "https://www.registry.google/",
	"whoisServer": "whois.nic.google",
	"rdapURLs": [
		"https://www.registry.google/rdap/"
	],
	"nameServers": [
		"ns-tld1.charlestonroadregistry.com",
		"ns-tld2.charlestonroadregistry.com",
		"ns-tld3.charlestonroadregistry.com",
		"ns-tld4.charlestonroadregistry.com",
		"ns-tld5.charlestonroadregistry.com"
	],
	"tags": [
		"generic"
	],
	"policies": [
		{
			"type": "idn-table",
			"key": "mul-Arab",
			"value": "https://www.iana.org/domains/idn-tables/tables/ing_arab_1.0.txt"
		},
		{
			"type": "idn-table",
			"key": "mul-Armn",
			"value": "https://www.iana.org/domains/idn-tables/tables/ing_armn_1.0.txt"
		},
		{
			"type": "idn-table",
			"key": "mul-Beng",
			"value": "https://www.iana.org/domains/idn-tables/tables/ing_beng_1.0.txt"
		},
		{
			"type": "idn-table",
			"key": "mul-Cyrl",
			"value": "https://www.iana.org/domains/idn-tables/tables/ing_cyrl_1.0.txt"
		},
		{
			"type": "idn-table",
			"key": "mul-Deva",
			"value": "https://www.iana.org/domains/idn-tables/tables/ing_deva_1.0.txt"
		},
		{
			"type": "idn-table",
			"key": "mul-Ethi",
			"value": "https://www.iana.org/domains/idn-tables/tables/ing_ethi_1.0.txt"
		},
		{
			"type": "idn-table",
			"key": "mul-Geor",
			"value": "https://www.iana.org/domains/idn-tables/tables/ing_geor_1.0.txt"
		},
		{
			"type": "idn-table",
			"key": "mul-Grek",
			"value": "https://www.iana.org/domains/idn-tables/tables/ing_grek_1.0.txt"
		},
		{
			"type": "idn-table",
			"key": "mul-Guru",
			"value": "https://www.iana.org/domains/idn-tables/tables/ing_guru_1.0.txt"
		},
		{
			"type": "idn-table",
			"key": "mul-Hebr",
			"value": "https://www.iana.org/domains/idn-tables/tables/ing_hebr_1.0.txt"
		},
		{
			"type": "idn-table",
			"key": "mul-Jpan",
			"value": "https://www.iana.org/domains/idn-tables/tables/ing_jpan_1.0.txt"
		},
		{
			"type": "idn-table",
			"key": "mul-Khmr",
			"value": "https://www.iana.org/domains/idn-tables/tables/ing_khmr_1.0.txt"
		},
		{
			"type": "idn-table",
			"key": "mul-Knda",
			"value": "https://www.iana.org/domains/idn-tables/tables/ing_knda_1.0.txt"
		},
		{
			"type": "idn-table",
			"key": "mul-Kore",
			"value": "https://www.iana.org/domains/idn-tables/tables/ing_kore_1.0.txt"
		},
		{
			"type": "idn-table",
			"key": "mul-Latn",
			"value": "https://www.iana.org/domains/idn-tables/tables/ing_latn_1.0.txt"
		},
		{
			"type": "idn-table",
			"key": "mul-Mlym",
			"value": "https://www.iana.org/domains/idn-tables/tables/ing_mlym_1.0.txt"
		},
		{
			"type": "idn-table",
			"key": "mul-Mymr",
			"value": "https://www.iana.org/domains/idn-tables/tables/ing_mymr_1.0.txt"
		},
		{
			"type": "idn-table",
			"key": "mul-Orya",
			"value": "https://www.iana.org/domains/idn-tables/tables/ing_orya_1.0.txt"
		},
		{
			"type": "idn-table",
			"key": "mul-Sinh",
			"value": "https://www.iana.org/domains/idn-tables/tables/ing_sinh_1.0.txt"
		},
		{
			"type": "idn-table",
			"key": "mul-Taml",
			"value": "https://www.iana.org/domains/idn-tables/tables/ing_taml_1.0.txt"
		},
		{
			"type": "idn-table",
			"key": "mul-Telu",
			"value": "https://www.iana.org/domains/idn-tables/tables/ing_telu_1.0.txt"
		},
		{
			"type": "idn-table",
			"key": "mul-Thai",
			"value": "https://www.iana.org/domains/idn-tables/tables/ing_thai_1.0.txt"
		},
		{
			"type": "idn-table",
			"key": "mul-Tibt",
			"value": "https://www.iana.org/domains/idn-tables/tables/ing_tibt_1.0.txt"
		},
		{
			"type": "idn-table",
			"key": "zh-Hans",
			"value": "https://www.iana.org/domains/idn-tables/tables/ing_zh-hans_1.0.txt"
		},
		{
			"type": "idn-table",
			"key": "zh-Hant",
			"value": "https://www.iana.org/domains/idn-tables/tables/ing_zh-hant_1.0.txt"
		}
	]
}
