{
	"domain": "新加坡",
	"whoisServer": "whois.sgnic.sg",
	"nameServers": [
		"dsany.sgnic.sg",
		"dsany2.sgnic.sg",
		"dsany3.sgnic.sg",
		"ns4.apnic.net",
		"pch.sgzones.sg"
	],
	"tags": [
		"generic"
	]
}
