{
	"domain": "bar",
	"whoisServer": "whois.nic.bar",
	"rdapURLs": [
		"https://rdap.centralnic.com/bar/"
	],
	"nameServers": [
		"a.nic.bar",
		"b.nic.bar",
		"c.nic.bar",
		"d.nic.bar"
	],
	"tags": [
		"generic"
	],
	"policies": [
		{
			"type": "idn-table",
			"key": "mul-Latn",
			"value": "https://www.iana.org/domains/idn-tables/tables/bar_latn_1.0.txt"
		}
	]
}
