{
	"domain": "bg",
	"infoURL": "https://www.register.bg/user/",
	"whoisServer": "whois.register.bg",
	"nameServers": [
		"a.nic.bg",
		"b.nic.bg",
		"c.nic.bg",
		"d.nic.bg",
		"e.nic.bg",
		"p.nic.bg"
	],
	"tags": [
		"country",
		"geo"
	],
	"policies": [
		{
			"type": "idn-table",
			"key": "bg",
			"value": "https://www.iana.org/domains/idn-tables/tables/bg_bg-bg_1.0.html"
		},
		{
			"type": "idn-table",
			"key": "bg-BG",
			"value": "https://www.iana.org/domains/idn-tables/tables/bg_bg-bg_1.0.html"
		},
		{
			"type": "idn-table",
			"key": "ru",
			"value": "https://www.iana.org/domains/idn-tables/tables/bg_ru-bg_1.0.html"
		},
		{
			"type": "idn-table",
			"key": "ru-BG",
			"value": "https://www.iana.org/domains/idn-tables/tables/bg_ru-bg_1.0.html"
		}
	]
}
