{
	"domain": "pharmacy",
	"infoURL": "https://newgtlds.icann.org/",
	"whoisServer": "whois.nic.pharmacy",
	"rdapURLs": [
		"https://rdap.nic.pharmacy/"
	],
	"nameServers": [
		"dns1.nic.pharmacy",
		"dns2.nic.pharmacy",
		"dns3.nic.pharmacy",
		"dns4.nic.pharmacy",
		"dnsa.nic.pharmacy",
		"dnsb.nic.pharmacy",
		"dnsc.nic.pharmacy",
		"dnsd.nic.pharmacy"
	],
	"tags": [
		"generic"
	],
	"policies": [
		{
			"type": "idn-table",
			"key": "es",
			"value": "https://www.iana.org/domains/idn-tables/tables/pharmacy_es_3.0.xml"
		}
	]
}
