{
	"domain": "deloitte",
	"infoURL": "https://newgtlds.icann.org/",
	"whoisServer": "whois.nic.deloitte",
	"rdapURLs": [
		"https://rdap.centralnic.com/deloitte/"
	],
	"nameServers": [
		"a.nic.deloitte",
		"b.nic.deloitte",
		"c.nic.deloitte",
		"d.nic.deloitte"
	],
	"tags": [
		"brand",
		"generic"
	],
	"policies": [
		{
			"type": "idn-table",
			"key": "ar",
			"value": "https://www.iana.org/domains/idn-tables/tables/deloitte_ar_1.1.txt"
		},
		{
			"type": "idn-table",
			"key": "de",
			"value": "https://www.iana.org/domains/idn-tables/tables/deloitte_de_1.0.txt"
		},
		{
			"type": "idn-table",
			"key": "es",
			"value": "https://www.iana.org/domains/idn-tables/tables/deloitte_es_1.0.txt"
		},
		{
			"type": "idn-table",
			"key": "fr",
			"value": "https://www.iana.org/domains/idn-tables/tables/deloitte_fr_1.0.txt"
		},
		{
			"type": "idn-table",
			"key": "ja",
			"value": "https://www.iana.org/domains/idn-tables/tables/deloitte_ja_1.0.txt"
		},
		{
			"type": "idn-table",
			"key": "nl",
			"value": "https://www.iana.org/domains/idn-tables/tables/deloitte_nl_1.0.txt"
		},
		{
			"type": "idn-table",
			"key": "pt",
			"value": "https://www.iana.org/domains/idn-tables/tables/deloitte_pt_1.0.txt"
		},
		{
			"type": "idn-table",
			"key": "ru",
			"value": "https://www.iana.org/domains/idn-tables/tables/deloitte_ru_1.0.txt"
		},
		{
			"type": "idn-table",
			"key": "zh",
			"value": "https://www.iana.org/domains/idn-tables/tables/deloitte_zh_1.0.txt"
		}
	]
}
