{
	"domain": "auto",
	"infoURL": "https://nic.auto/",
	"whoisServer": "whois.nic.auto",
	"rdapURLs": [
		"https://rdap.centralnic.com/auto/"
	],
	"nameServers": [
		"a.nic.auto",
		"b.nic.auto",
		"c.nic.auto",
		"d.nic.auto"
	],
	"tags": [
		"generic"
	],
	"policies": [
		{
			"type": "idn-table",
			"key": "de",
			"value": "https://www.iana.org/domains/idn-tables/tables/audio_de_1.0.txt"
		},
		{
			"type": "idn-table",
			"key": "es",
			"value": "https://www.iana.org/domains/idn-tables/tables/audio_es_1.0.txt"
		},
		{
			"type": "idn-table",
			"key": "fr",
			"value": "https://www.iana.org/domains/idn-tables/tables/audio_fr_1.0.txt"
		},
		{
			"type": "idn-table",
			"key": "it",
			"value": "https://www.iana.org/domains/idn-tables/tables/audio_it_1.0.txt"
		},
		{
			"type": "idn-table",
			"key": "mul-Cyrl",
			"value": "https://www.iana.org/domains/idn-tables/tables/audio_cyrl_1.0.txt"
		},
		{
			"type": "idn-table",
			"key": "pt",
			"value": "https://www.iana.org/domains/idn-tables/tables/audio_pt_1.0.txt"
		},
		{
			"type": "idn-table",
			"key": "zh",
			"value": "https://www.iana.org/domains/idn-tables/tables/audio_zh_1.1.txt"
		}
	]
}
