{
	"domain": "se",
	"whoisServer": "whois.iis.se",
	"nameServers": [
		"a.ns.se",
		"b.ns.se",
		"c.ns.se",
		"f.ns.se",
		"g.ns.se",
		"i.ns.se",
		"m.ns.se",
		"x.ns.se",
		"y.ns.se",
		"z.ns.se"
	],
	"tags": [
		"country",
		"geo"
	],
	"policies": [
		{
			"type": "idn-table",
			"key": "mul-Latn",
			"value": "https://www.iana.org/domains/idn-tables/tables/se_latn_3.xml",
			"comment": "https://www.iis.se/english/domains/se/idn/"
		},
		{
			"type": "idn-table",
			"key": "sv-SE",
			"value": "https://www.iana.org/domains/idn-tables/tables/se_sv-se_1.0.html"
		},
		{
			"type": "idn-table",
			"key": "yi",
			"value": "https://www.iana.org/domains/idn-tables/tables/se_yi_3.xml"
		}
	]
}
