{
	"domain": "whoswho",
	"infoURL": "https://newgtlds.icann.org/",
	"whoisServer": "whois.nic.whoswho",
	"rdapURLs": [
		"https://rdap.nic.whoswho/"
	],
	"nameServers": [
		"anycast10.irondns.net",
		"anycast23.irondns.net",
		"anycast24.irondns.net",
		"anycast9.irondns.net"
	],
	"tags": [
		"generic"
	],
	"policies": [
		{
			"type": "idn-table",
			"key": "de",
			"value": "https://www.iana.org/domains/idn-tables/tables/whoswho_de_1.0.txt"
		},
		{
			"type": "idn-table",
			"key": "es",
			"value": "https://www.iana.org/domains/idn-tables/tables/whoswho_es_1.0.txt"
		},
		{
			"type": "idn-table",
			"key": "fr",
			"value": "https://www.iana.org/domains/idn-tables/tables/whoswho_fr_1.0.txt"
		},
		{
			"type": "idn-table",
			"key": "ja",
			"value": "https://www.iana.org/domains/idn-tables/tables/whoswho_ja_1.0.txt"
		},
		{
			"type": "idn-table",
			"key": "ko",
			"value": "https://www.iana.org/domains/idn-tables/tables/whoswho_ko_1.0.txt"
		},
		{
			"type": "idn-table",
			"key": "pl",
			"value": "https://www.iana.org/domains/idn-tables/tables/whoswho_pl_1.0.txt"
		},
		{
			"type": "idn-table",
			"key": "pt",
			"value": "https://www.iana.org/domains/idn-tables/tables/whoswho_pt_1.0.txt"
		},
		{
			"type": "idn-table",
			"key": "ru",
			"value": "https://www.iana.org/domains/idn-tables/tables/whoswho_ru_1.0.txt"
		},
		{
			"type": "idn-table",
			"key": "zh",
			"value": "https://www.iana.org/domains/idn-tables/tables/whoswho_zh_1.0.txt"
		}
	]
}
