{
	"domain": "wang",
	"whoisServer": "whois.gtld.knet.cn",
	"rdapURLs": [
		"https://rdap.zdnsgtld.com/wang/"
	],
	"nameServers": [
		"a.zdnscloud.com",
		"b.zdnscloud.com",
		"c.zdnscloud.com",
		"d.zdnscloud.com",
		"f.zdnscloud.com",
		"g.zdnscloud.com",
		"i.zdnscloud.com",
		"j.zdnscloud.com"
	],
	"tags": [
		"generic"
	],
	"policies": [
		{
			"type": "idn-table",
			"key": "zh-Hans",
			"value": "https://www.iana.org/domains/idn-tables/tables/wang_zh-hans_1.0.txt"
		},
		{
			"type": "idn-table",
			"key": "zh-Hant",
			"value": "https://www.iana.org/domains/idn-tables/tables/wang_zh-hant_1.0.txt"
		}
	]
}
