{
	"domain": "tel",
	"whoisServer": "whois.nic.tel",
	"rdapURLs": [
		"https://rdap.nic.tel/"
	],
	"nameServers": [
		"ns1.dns.nic.tel",
		"ns2.dns.nic.tel",
		"ns3.dns.nic.tel",
		"ns4.dns.nic.tel",
		"ns5.dns.nic.tel",
		"ns6.dns.nic.tel",
		"ns7.dns.nic.tel",
		"ns8.dns.nic.tel"
	],
	"tags": [
		"generic",
		"sponsored"
	],
	"policies": [
		{
			"type": "idn-table",
			"key": "da",
			"value": "https://www.iana.org/domains/idn-tables/tables/tel_da_3.0.xml"
		},
		{
			"type": "idn-table",
			"key": "de",
			"value": "https://www.iana.org/domains/idn-tables/tables/tel_de_3.0.xml"
		},
		{
			"type": "idn-table",
			"key": "es",
			"value": "https://www.iana.org/domains/idn-tables/tables/tel_es_3.0.xml"
		},
		{
			"type": "idn-table",
			"key": "fi",
			"value": "https://www.iana.org/domains/idn-tables/tables/tel_fi_3.0.xml"
		},
		{
			"type": "idn-table",
			"key": "fr",
			"value": "https://www.iana.org/domains/idn-tables/tables/tel_fr_3.0.xml"
		},
		{
			"type": "idn-table",
			"key": "hu",
			"value": "https://www.iana.org/domains/idn-tables/tables/tel_hu_3.0.xml"
		},
		{
			"type": "idn-table",
			"key": "is",
			"value": "https://www.iana.org/domains/idn-tables/tables/tel_is_3.0.xml"
		},
		{
			"type": "idn-table",
			"key": "ja",
			"value": "https://www.iana.org/domains/idn-tables/tables/tel_ja_3.0.xml"
		},
		{
			"type": "idn-table",
			"key": "ko",
			"value": "https://www.iana.org/domains/idn-tables/tables/tel_ko_3.0.xml"
		},
		{
			"type": "idn-table",
			"key": "lt",
			"value": "https://www.iana.org/domains/idn-tables/tables/tel_lt_3.0.xml"
		},
		{
			"type": "idn-table",
			"key": "lv",
			"value": "https://www.iana.org/domains/idn-tables/tables/tel_lv_3.0.xml"
		},
		{
			"type": "idn-table",
			"key": "no",
			"value": "https://www.iana.org/domains/idn-tables/tables/tel_no_3.0.xml"
		},
		{
			"type": "idn-table",
			"key": "pl",
			"value": "https://www.iana.org/domains/idn-tables/tables/tel_pl_3.0.xml"
		},
		{
			"type": "idn-table",
			"key": "pt",
			"value": "https://www.iana.org/domains/idn-tables/tables/tel_pt_3.0.xml"
		},
		{
			"type": "idn-table",
			"key": "ru",
			"value": "https://www.iana.org/domains/idn-tables/tables/tel_ru_3.0.xml"
		},
		{
			"type": "idn-table",
			"key": "sv",
			"value": "https://www.iana.org/domains/idn-tables/tables/tel_sv_3.0.xml"
		},
		{
			"type": "idn-table",
			"key": "zh",
			"value": "https://www.iana.org/domains/idn-tables/tables/tel_zh_3.0.xml"
		}
	]
}
