{
	"domain": "dubai",
	"infoURL": "https://newgtlds.icann.org/",
	"whoisServer": "whois.nic.dubai",
	"rdapURLs": [
		"https://rdap.nic.dubai/"
	],
	"nameServers": [
		"gtld.alpha.aridns.net.au",
		"gtld.beta.aridns.net.au",
		"gtld.delta.aridns.net.au",
		"gtld.gamma.aridns.net.au"
	],
	"locations": [
		"AE-DU",
		"Dubai"
	],
	"tags": [
		"city",
		"generic",
		"geo"
	],
	"policies": [
		{
			"type": "idn-disallowed"
		}
	]
}
