{
	"domain": "in",
	"infoURL": "https://www.registry.in/",
	"whoisServer": "whois.registry.in",
	"nameServers": [
		"ns1.registry.in",
		"ns2.registry.in",
		"ns3.registry.in",
		"ns4.registry.in",
		"ns5.registry.in",
		"ns6.registry.in"
	],
	"tags": [
		"country",
		"geo"
	],
	"policies": [
		{
			"type": "idn-disallowed"
		}
	]
}
