{
	"domain": "uk",
	"infoURL": "https://www.nominet.uk/",
	"whoisServer": "whois.nic.uk",
	"nameServers": [
		"dns1.nic.uk",
		"dns2.nic.uk",
		"dns3.nic.uk",
		"dns4.nic.uk",
		"nsa.nic.uk",
		"nsb.nic.uk",
		"nsc.nic.uk",
		"nsd.nic.uk"
	],
	"tags": [
		"country",
		"geo"
	],
	"policies": [
		{
			"type": "idn-disallowed",
			"comment": "https://nominet-prod.s3.amazonaws.com/wp-content/uploads/2015/10/Rules_June_2014.pdf"
		}
	]
}
