{
	"domain": "erni",
	"infoURL": "https://newgtlds.icann.org/",
	"whoisServer": "whois.nic.erni",
	"rdapURLs": [
		"https://rdap.nic.erni/"
	],
	"nameServers": [
		"anycast10.irondns.net",
		"anycast23.irondns.net",
		"anycast24.irondns.net",
		"anycast9.irondns.net"
	],
	"tags": [
		"brand",
		"generic"
	],
	"policies": [
		{
			"type": "idn-disallowed"
		}
	]
}
