{
	"domain": "joy",
	"infoURL": "https://newgtlds.icann.org/",
	"whoisServer": "whois.nic.joy",
	"rdapURLs": [
		"https://rdap.nominet.uk/joy/"
	],
	"nameServers": [
		"dns1.nic.joy",
		"dns2.nic.joy",
		"dns3.nic.joy",
		"dns4.nic.joy",
		"dnsa.nic.joy",
		"dnsb.nic.joy",
		"dnsc.nic.joy",
		"dnsd.nic.joy"
	],
	"tags": [
		"generic"
	],
	"policies": [
		{
			"type": "idn-table",
			"key": "ar",
			"value": "https://www.iana.org/domains/idn-tables/tables/joy_ar_2.1.txt"
		},
		{
			"type": "idn-table",
			"key": "da",
			"value": "https://www.iana.org/domains/idn-tables/tables/joy_da_2.1.txt"
		},
		{
			"type": "idn-table",
			"key": "de",
			"value": "https://www.iana.org/domains/idn-tables/tables/joy_de_2.1.txt"
		},
		{
			"type": "idn-table",
			"key": "es",
			"value": "https://www.iana.org/domains/idn-tables/tables/joy_es_2.1.txt"
		},
		{
			"type": "idn-table",
			"key": "fi",
			"value": "https://www.iana.org/domains/idn-tables/tables/joy_fi_2.1.txt"
		},
		{
			"type": "idn-table",
			"key": "fr",
			"value": "https://www.iana.org/domains/idn-tables/tables/joy_fr_2.1.txt"
		},
		{
			"type": "idn-table",
			"key": "hu",
			"value": "https://www.iana.org/domains/idn-tables/tables/joy_hu_2.1.txt"
		},
		{
			"type": "idn-table",
			"key": "is",
			"value": "https://www.iana.org/domains/idn-tables/tables/joy_is_2.1.txt"
		},
		{
			"type": "idn-table",
			"key": "ja",
			"value": "https://www.iana.org/domains/idn-tables/tables/joy_ja_2.1.txt"
		},
		{
			"type": "idn-table",
			"key": "ko",
			"value": "https://www.iana.org/domains/idn-tables/tables/joy_ko_2.1.txt"
		},
		{
			"type": "idn-table",
			"key": "lt",
			"value": "https://www.iana.org/domains/idn-tables/tables/joy_lt_2.1.txt"
		},
		{
			"type": "idn-table",
			"key": "lv",
			"value": "https://www.iana.org/domains/idn-tables/tables/joy_lv_2.1.txt"
		},
		{
			"type": "idn-table",
			"key": "no",
			"value": "https://www.iana.org/domains/idn-tables/tables/joy_no_2.1.txt"
		},
		{
			"type": "idn-table",
			"key": "pl",
			"value": "https://www.iana.org/domains/idn-tables/tables/joy_pl_2.1.txt"
		},
		{
			"type": "idn-table",
			"key": "pt",
			"value": "https://www.iana.org/domains/idn-tables/tables/joy_pt_2.1.txt"
		},
		{
			"type": "idn-table",
			"key": "ru",
			"value": "https://www.iana.org/domains/idn-tables/tables/joy_ru_2.1.txt"
		},
		{
			"type": "idn-table",
			"key": "sv",
			"value": "https://www.iana.org/domains/idn-tables/tables/joy_sv_2.1.txt"
		},
		{
			"type": "idn-table",
			"key": "zh",
			"value": "https://www.iana.org/domains/idn-tables/tables/joy_zh_2.1.txt"
		}
	]
}
