{
	"domain": "like",
	"infoURL": "https://newgtlds.icann.org/",
	"whoisServer": "whois.nic.like",
	"rdapURLs": [
		"https://rdap.nominet.uk/like/"
	],
	"nameServers": [
		"dns1.nic.like",
		"dns2.nic.like",
		"dns3.nic.like",
		"dns4.nic.like",
		"dnsa.nic.like",
		"dnsb.nic.like",
		"dnsc.nic.like",
		"dnsd.nic.like"
	],
	"tags": [
		"brand",
		"generic"
	],
	"policies": [
		{
			"type": "idn-table",
			"key": "ar",
			"value": "https://www.iana.org/domains/idn-tables/tables/like_ar_2.1.txt"
		},
		{
			"type": "idn-table",
			"key": "da",
			"value": "https://www.iana.org/domains/idn-tables/tables/like_da_2.1.txt"
		},
		{
			"type": "idn-table",
			"key": "de",
			"value": "https://www.iana.org/domains/idn-tables/tables/like_de_2.1.txt"
		},
		{
			"type": "idn-table",
			"key": "es",
			"value": "https://www.iana.org/domains/idn-tables/tables/like_es_2.1.txt"
		},
		{
			"type": "idn-table",
			"key": "fi",
			"value": "https://www.iana.org/domains/idn-tables/tables/like_fi_2.1.txt"
		},
		{
			"type": "idn-table",
			"key": "fr",
			"value": "https://www.iana.org/domains/idn-tables/tables/like_fr_2.1.txt"
		},
		{
			"type": "idn-table",
			"key": "hu",
			"value": "https://www.iana.org/domains/idn-tables/tables/like_hu_2.1.txt"
		},
		{
			"type": "idn-table",
			"key": "is",
			"value": "https://www.iana.org/domains/idn-tables/tables/like_is_2.1.txt"
		},
		{
			"type": "idn-table",
			"key": "ja",
			"value": "https://www.iana.org/domains/idn-tables/tables/like_ja_2.1.txt"
		},
		{
			"type": "idn-table",
			"key": "ko",
			"value": "https://www.iana.org/domains/idn-tables/tables/like_ko_2.1.txt"
		},
		{
			"type": "idn-table",
			"key": "lt",
			"value": "https://www.iana.org/domains/idn-tables/tables/like_lt_2.1.txt"
		},
		{
			"type": "idn-table",
			"key": "lv",
			"value": "https://www.iana.org/domains/idn-tables/tables/like_lv_2.1.txt"
		},
		{
			"type": "idn-table",
			"key": "no",
			"value": "https://www.iana.org/domains/idn-tables/tables/like_no_2.1.txt"
		},
		{
			"type": "idn-table",
			"key": "pl",
			"value": "https://www.iana.org/domains/idn-tables/tables/like_pl_2.1.txt"
		},
		{
			"type": "idn-table",
			"key": "pt",
			"value": "https://www.iana.org/domains/idn-tables/tables/like_pt_2.1.txt"
		},
		{
			"type": "idn-table",
			"key": "ru",
			"value": "https://www.iana.org/domains/idn-tables/tables/like_ru_2.1.txt"
		},
		{
			"type": "idn-table",
			"key": "sv",
			"value": "https://www.iana.org/domains/idn-tables/tables/like_sv_2.1.txt"
		},
		{
			"type": "idn-table",
			"key": "zh",
			"value": "https://www.iana.org/domains/idn-tables/tables/like_zh_2.1.txt"
		}
	]
}
