{
	"domain": "inc",
	"infoURL": "https://newgtlds.icann.org/",
	"whoisServer": "whois.nic.inc",
	"rdapURLs": [
		"https://whois.nic.inc/rdap/"
	],
	"nameServers": [
		"ns1.uniregistry.net",
		"ns2.uniregistry.info",
		"ns3.uniregistry.net",
		"ns4.uniregistry.info"
	],
	"tags": [
		"generic"
	],
	"policies": [
		{
			"type": "idn-table",
			"key": "de",
			"value": "https://www.iana.org/domains/idn-tables/tables/inc_de_1.0.txt"
		},
		{
			"type": "idn-table",
			"key": "es",
			"value": "https://www.iana.org/domains/idn-tables/tables/inc_es_1.0.txt"
		},
		{
			"type": "idn-table",
			"key": "fr",
			"value": "https://www.iana.org/domains/idn-tables/tables/inc_fr_1.0.txt"
		},
		{
			"type": "idn-table",
			"key": "it",
			"value": "https://www.iana.org/domains/idn-tables/tables/inc_it_1.0.txt"
		},
		{
			"type": "idn-table",
			"key": "ja",
			"value": "https://www.iana.org/domains/idn-tables/tables/inc_ja_1.0.txt"
		},
		{
			"type": "idn-table",
			"key": "mul-Cyrl",
			"value": "https://www.iana.org/domains/idn-tables/tables/inc_cyrl_1.0.txt"
		},
		{
			"type": "idn-table",
			"key": "pt",
			"value": "https://www.iana.org/domains/idn-tables/tables/inc_pt_1.0.txt"
		},
		{
			"type": "idn-table",
			"key": "zh",
			"value": "https://www.iana.org/domains/idn-tables/tables/inc_zh_1.0.txt"
		}
	]
}
