{
	"domain": "flowers",
	"infoURL": "https://nic.flowers/",
	"whoisServer": "whois.uniregistry.net",
	"rdapURLs": [
		"https://whois.uniregistry.net/rdap/"
	],
	"nameServers": [
		"ns1.uniregistry.net",
		"ns2.uniregistry.info",
		"ns3.uniregistry.net",
		"ns4.uniregistry.info"
	],
	"tags": [
		"generic"
	],
	"policies": [
		{
			"type": "idn-table",
			"key": "de",
			"value": "https://www.iana.org/domains/idn-tables/tables/audio_de_1.0.txt"
		},
		{
			"type": "idn-table",
			"key": "es",
			"value": "https://www.iana.org/domains/idn-tables/tables/audio_es_1.0.txt"
		},
		{
			"type": "idn-table",
			"key": "fr",
			"value": "https://www.iana.org/domains/idn-tables/tables/audio_fr_1.0.txt"
		},
		{
			"type": "idn-table",
			"key": "it",
			"value": "https://www.iana.org/domains/idn-tables/tables/audio_it_1.0.txt"
		},
		{
			"type": "idn-table",
			"key": "ja",
			"value": "https://www.iana.org/domains/idn-tables/tables/flowers_ja_1.1.txt"
		},
		{
			"type": "idn-table",
			"key": "mul-Cyrl",
			"value": "https://www.iana.org/domains/idn-tables/tables/audio_cyrl_1.0.txt"
		},
		{
			"type": "idn-table",
			"key": "pt",
			"value": "https://www.iana.org/domains/idn-tables/tables/audio_pt_1.0.txt"
		},
		{
			"type": "idn-table",
			"key": "zh",
			"value": "https://www.iana.org/domains/idn-tables/tables/audio_zh_1.1.txt"
		}
	]
}
