Copyright 1986-2019 Xilinx, Inc. All Rights Reserved.
--------------------------------------------------------------------------------------------------------------------------------------------------------
| Tool Version : Vivado v.2019.1.1 (lin64) Build 2580384 Sat Jun 29 08:04:45 MDT 2019
| Date         : Fri Sep  4 17:20:27 2020
| Host         : ettus-betty running 64-bit Ubuntu 18.04.2 LTS
| Command      : report_utilization -omit_locs -file /home/buildbot/fpga-worker/build_FPGA_N310_HG/work/src/fpga/usrp3/top/n3xx/build-N310_HG/build.rpt
| Design       : n3xx
| Device       : 7z100ffg900-2
| Design State : Routed
--------------------------------------------------------------------------------------------------------------------------------------------------------

Utilization Design Information

Table of Contents
-----------------
1. Slice Logic
1.1 Summary of Registers by Type
2. Slice Logic Distribution
3. Memory
4. DSP
5. IO and GT Specific
6. Clocking
7. Specific Feature
8. Primitives
9. Black Boxes
10. Instantiated Netlists

1. Slice Logic
--------------

+----------------------------+--------+-----------+-------+
|          Site Type         |  Used  | Available | Util% |
+----------------------------+--------+-----------+-------+
| Slice LUTs                 | 161243 |    277400 | 58.13 |
|   LUT as Logic             | 134803 |    277400 | 48.60 |
|   LUT as Memory            |  26440 |    108200 | 24.44 |
|     LUT as Distributed RAM |   8596 |           |       |
|     LUT as Shift Register  |  17844 |           |       |
| Slice Registers            | 280906 |    554800 | 50.63 |
|   Register as Flip Flop    | 280892 |    554800 | 50.63 |
|   Register as Latch        |      0 |    554800 |  0.00 |
|   Register as AND/OR       |     14 |    554800 | <0.01 |
| F7 Muxes                   |    850 |    138700 |  0.61 |
| F8 Muxes                   |    208 |     69350 |  0.30 |
+----------------------------+--------+-----------+-------+


1.1 Summary of Registers by Type
--------------------------------

+--------+--------------+-------------+--------------+
|  Total | Clock Enable | Synchronous | Asynchronous |
+--------+--------------+-------------+--------------+
| 14     |            _ |           - |            - |
| 0      |            _ |           - |          Set |
| 0      |            _ |           - |        Reset |
| 0      |            _ |         Set |            - |
| 0      |            _ |       Reset |            - |
| 0      |          Yes |           - |            - |
| 4586   |          Yes |           - |          Set |
| 26946  |          Yes |           - |        Reset |
| 4408   |          Yes |         Set |            - |
| 245010 |          Yes |       Reset |            - |
+--------+--------------+-------------+--------------+


2. Slice Logic Distribution
---------------------------

+--------------------------------------------+--------+-----------+-------+
|                  Site Type                 |  Used  | Available | Util% |
+--------------------------------------------+--------+-----------+-------+
| Slice                                      |  67336 |     69350 | 97.10 |
|   SLICEL                                   |  41083 |           |       |
|   SLICEM                                   |  26253 |           |       |
| LUT as Logic                               | 134803 |    277400 | 48.60 |
|   using O5 output only                     |     81 |           |       |
|   using O6 output only                     |  93527 |           |       |
|   using O5 and O6                          |  41195 |           |       |
| LUT as Memory                              |  26440 |    108200 | 24.44 |
|   LUT as Distributed RAM                   |   8596 |           |       |
|     using O5 output only                   |      0 |           |       |
|     using O6 output only                   |    140 |           |       |
|     using O5 and O6                        |   8456 |           |       |
|   LUT as Shift Register                    |  17844 |           |       |
|     using O5 output only                   |   7411 |           |       |
|     using O6 output only                   |   8970 |           |       |
|     using O5 and O6                        |   1463 |           |       |
| Slice Registers                            | 280906 |    554800 | 50.63 |
|   Register driven from within the Slice    | 135434 |           |       |
|   Register driven from outside the Slice   | 145472 |           |       |
|     LUT in front of the register is unused | 106454 |           |       |
|     LUT in front of the register is used   |  39018 |           |       |
| Unique Control Sets                        |   9955 |     69350 | 14.35 |
+--------------------------------------------+--------+-----------+-------+
* Note: Available Control Sets calculated as Slice Registers / 8, Review the Control Sets Report for more information regarding control sets.


3. Memory
---------

+-------------------+-------+-----------+-------+
|     Site Type     |  Used | Available | Util% |
+-------------------+-------+-----------+-------+
| Block RAM Tile    | 506.5 |       755 | 67.09 |
|   RAMB36/FIFO*    |   464 |       755 | 61.46 |
|     RAMB36E1 only |   464 |           |       |
|   RAMB18          |    85 |      1510 |  5.63 |
|     RAMB18E1 only |    85 |           |       |
+-------------------+-------+-----------+-------+
* Note: Each Block RAM Tile only has one FIFO logic available and therefore can accommodate only one FIFO36E1 or one FIFO18E1. However, if a FIFO18E1 occupies a Block RAM Tile, that tile can still accommodate a RAMB18E1


4. DSP
------

+----------------+------+-----------+-------+
|    Site Type   | Used | Available | Util% |
+----------------+------+-----------+-------+
| DSPs           |  352 |      2020 | 17.43 |
|   DSP48E1 only |  352 |           |       |
+----------------+------+-----------+-------+


5. IO and GT Specific
---------------------

+-----------------------------+------+-----------+--------+
|          Site Type          | Used | Available |  Util% |
+-----------------------------+------+-----------+--------+
| Bonded IOB                  |  252 |       362 |  69.61 |
|   IOB Master Pads           |  128 |           |        |
|   IOB Slave Pads            |  124 |           |        |
|   IOB Flip Flops            |   58 |           |        |
| Bonded IPADs                |   28 |        50 |  56.00 |
| Bonded OPADs                |   20 |        32 |  62.50 |
| Bonded IOPADs               |  130 |       130 | 100.00 |
| PHY_CONTROL                 |    2 |         8 |  25.00 |
| PHASER_REF                  |    2 |         8 |  25.00 |
| OUT_FIFO                    |    8 |        32 |  25.00 |
| IN_FIFO                     |    4 |        32 |  12.50 |
| IDELAYCTRL                  |    1 |         8 |  12.50 |
| IBUFDS                      |    8 |       348 |   2.30 |
| GTXE2_COMMON                |    3 |         4 |  75.00 |
| GTXE2_CHANNEL               |   10 |        16 |  62.50 |
| PHASER_OUT/PHASER_OUT_PHY   |    8 |        32 |  25.00 |
|   PHASER_OUT_PHY only       |    8 |           |        |
| PHASER_IN/PHASER_IN_PHY     |    4 |        32 |  12.50 |
|   PHASER_IN_PHY only        |    4 |           |        |
| IDELAYE2/IDELAYE2_FINEDELAY |   32 |       400 |   8.00 |
|   IDELAYE2 only             |   32 |           |        |
| ODELAYE2/ODELAYE2_FINEDELAY |    0 |       150 |   0.00 |
| IBUFDS_GTE2                 |    4 |         8 |  50.00 |
| ILOGIC                      |   40 |       362 |  11.05 |
|   IFF_IDDR_Register         |    8 |           |        |
|   ISERDES                   |   32 |       362 |        |
| OLOGIC                      |  132 |       362 |  36.46 |
|   OUTFF_Register            |   58 |           |        |
|   OUTFF_ODDR_Register       |    9 |           |        |
|   TFF_ODDR_Register         |    4 |           |        |
|   OSERDES                   |   65 |       362 |        |
+-----------------------------+------+-----------+--------+


6. Clocking
-----------

+------------+------+-----------+-------+
|  Site Type | Used | Available | Util% |
+------------+------+-----------+-------+
| BUFGCTRL   |   19 |        32 | 59.38 |
| BUFIO      |    0 |        32 |  0.00 |
| MMCME2_ADV |    5 |         8 | 62.50 |
| PLLE2_ADV  |    1 |         8 | 12.50 |
| BUFMRCE    |    0 |        16 |  0.00 |
| BUFHCE     |    6 |       168 |  3.57 |
| BUFR       |    1 |        32 |  3.13 |
+------------+------+-----------+-------+


7. Specific Feature
-------------------

+-------------+------+-----------+--------+
|  Site Type  | Used | Available |  Util% |
+-------------+------+-----------+--------+
| BSCANE2     |    0 |         4 |   0.00 |
| CAPTUREE2   |    0 |         1 |   0.00 |
| DNA_PORT    |    0 |         1 |   0.00 |
| EFUSE_USR   |    0 |         1 |   0.00 |
| FRAME_ECCE2 |    0 |         1 |   0.00 |
| ICAPE2      |    0 |         2 |   0.00 |
| PCIE_2_1    |    0 |         1 |   0.00 |
| STARTUPE2   |    0 |         1 |   0.00 |
| XADC        |    1 |         1 | 100.00 |
+-------------+------+-----------+--------+


8. Primitives
-------------

+------------------------+--------+----------------------+
|        Ref Name        |  Used  |  Functional Category |
+------------------------+--------+----------------------+
| FDRE                   | 245010 |         Flop & Latch |
| LUT3                   |  61804 |                  LUT |
| LUT6                   |  34869 |                  LUT |
| LUT2                   |  27135 |                  LUT |
| FDCE                   |  26946 |         Flop & Latch |
| LUT4                   |  24543 |                  LUT |
| LUT5                   |  22088 |                  LUT |
| RAMD32                 |  13480 |   Distributed Memory |
| SRL16E                 |  10867 |   Distributed Memory |
| CARRY4                 |   9044 |           CarryLogic |
| SRLC32E                |   8440 |   Distributed Memory |
| LUT1                   |   5559 |                  LUT |
| FDPE                   |   4586 |         Flop & Latch |
| FDSE                   |   4408 |         Flop & Latch |
| RAMS32                 |   3436 |   Distributed Memory |
| MUXF7                  |    850 |                MuxFx |
| RAMB36E1               |    464 |         Block Memory |
| DSP48E1                |    352 |     Block Arithmetic |
| MUXF8                  |    208 |                MuxFx |
| OBUF                   |    172 |                   IO |
| RAMD64E                |    136 |   Distributed Memory |
| BIBUF                  |    130 |                   IO |
| RAMB18E1               |     85 |         Block Memory |
| OSERDESE2              |     65 |                   IO |
| IBUF                   |     60 |                   IO |
| OBUFT_DCIEN            |     32 |                   IO |
| ISERDESE2              |     32 |                   IO |
| IDELAYE2               |     32 |                   IO |
| IBUF_IBUFDISABLE       |     32 |                   IO |
| OBUFT                  |     26 |                   IO |
| BUFG                   |     14 |                Clock |
| ODDR                   |     13 |                   IO |
| AND2B1L                |     12 |               Others |
| GTXE2_CHANNEL          |     10 |                   IO |
| PHASER_OUT_PHY         |      8 |                   IO |
| OUT_FIFO               |      8 |                   IO |
| OBUFTDS_DCIEN          |      8 |                   IO |
| IDDR                   |      8 |                   IO |
| IBUFDS_IBUFDISABLE_INT |      8 |                   IO |
| IBUFDS                 |      8 |                   IO |
| MMCME2_ADV             |      5 |                Clock |
| INV                    |      5 |                  LUT |
| BUFGCTRL               |      5 |                Clock |
| PHASER_IN_PHY          |      4 |                   IO |
| IN_FIFO                |      4 |                   IO |
| IBUFDS_GTE2            |      4 |                   IO |
| BUFH                   |      4 |                Clock |
| GTXE2_COMMON           |      3 |                   IO |
| PHY_CONTROL            |      2 |                   IO |
| PHASER_REF             |      2 |                   IO |
| OR2L                   |      2 |               Others |
| OBUFDS                 |      2 |                   IO |
| BUFHCE                 |      2 |                Clock |
| XADC                   |      1 |               Others |
| USR_ACCESSE2           |      1 |               Others |
| PS7                    |      1 | Specialized Resource |
| PLLE2_ADV              |      1 |                Clock |
| IDELAYCTRL             |      1 |                   IO |
| BUFR                   |      1 |                Clock |
+------------------------+--------+----------------------+


9. Black Boxes
--------------

+----------+------+
| Ref Name | Used |
+----------+------+


10. Instantiated Netlists
-------------------------

+------------------------+------+
|        Ref Name        | Used |
+------------------------+------+
| fifo_short_2clk        |  142 |
| axi_hb47               |   12 |
| dds_sin_cos_lut_only   |    8 |
| complex_multiplier_dds |    8 |
| hbdec3                 |    4 |
| hbdec2                 |    4 |
| hbdec1                 |    4 |
| fifo_4k_2clk           |    4 |
| TdcCore                |    4 |
| axi_eth_dma            |    2 |
| axi64_8k_2clk_fifo     |    2 |
| axi64_4k_2clk_fifo     |    2 |
| SyncRegsIfc            |    2 |
| Jesd204bXcvrCore       |    2 |
| ten_gig_eth_pcs_pma    |    1 |
| one_gig_eth_pcs_pma    |    1 |
| misc_clock_gen         |    1 |
| ddr3_32bit             |    1 |
+------------------------+------+


Copyright 1986-2019 Xilinx, Inc. All Rights Reserved.
---------------------------------------------------------------------------------------------------------------------------------------------------------------------------
| Tool Version : Vivado v.2019.1.1 (lin64) Build 2580384 Sat Jun 29 08:04:45 MDT 2019
| Date         : Fri Sep  4 17:20:41 2020
| Host         : ettus-betty running 64-bit Ubuntu 18.04.2 LTS
| Command      : report_timing_summary -no_detailed_paths -file /home/buildbot/fpga-worker/build_FPGA_N310_HG/work/src/fpga/usrp3/top/n3xx/build-N310_HG/build.rpt -append
| Design       : n3xx
| Device       : 7z100-ffg900
| Speed File   : -2  PRODUCTION 1.11 2014-09-11
---------------------------------------------------------------------------------------------------------------------------------------------------------------------------

Timing Summary Report

------------------------------------------------------------------------------------------------
| Timer Settings
| --------------
------------------------------------------------------------------------------------------------

  Enable Multi Corner Analysis               :  Yes
  Enable Pessimism Removal                   :  Yes
  Pessimism Removal Resolution               :  Nearest Common Node
  Enable Input Delay Default Clock           :  No
  Enable Preset / Clear Arcs                 :  No
  Disable Flight Delays                      :  No
  Ignore I/O Paths                           :  No
  Timing Early Launch at Borrowing Latches   :  No
  Borrow Time for Max Delay Exceptions       :  Yes

  Corner  Analyze    Analyze    
  Name    Max Paths  Min Paths  
  ------  ---------  ---------  
  Slow    Yes        Yes        
  Fast    Yes        Yes        



check_timing report

Table of Contents
-----------------
1. checking no_clock
2. checking constant_clock
3. checking pulse_width_clock
4. checking unconstrained_internal_endpoints
5. checking no_input_delay
6. checking no_output_delay
7. checking multiple_clock
8. checking generated_clocks
9. checking loops
10. checking partial_input_delay
11. checking partial_output_delay
12. checking latch_loops

1. checking no_clock
--------------------
 There are 0 register/latch pins with no clock.


2. checking constant_clock
--------------------------
 There are 0 register/latch pins with constant_clock.


3. checking pulse_width_clock
-----------------------------
 There are 0 register/latch pins which need pulse_width check


4. checking unconstrained_internal_endpoints
--------------------------------------------
 There are 0 pins that are not constrained for maximum delay.

 There are 3 pins that are not constrained for maximum delay due to constant clock. (MEDIUM)


5. checking no_input_delay
--------------------------
 There are 6 input ports with no input delay specified. (HIGH)

 There are 0 input ports with no input delay but user has a false path constraint.


6. checking no_output_delay
---------------------------
 There are 7 ports with no output delay specified. (HIGH)

 There are 0 ports with no output delay but user has a false path constraint

 There are 2 ports with no output delay but with a timing clock defined on it or propagating through it (LOW)


7. checking multiple_clock
--------------------------
 There are 0 register/latch pins with multiple clocks.


8. checking generated_clocks
----------------------------
 There are 0 generated clocks that are not connected to a clock source.


9. checking loops
-----------------
 There are 0 combinational loops in the design.


10. checking partial_input_delay
--------------------------------
 There are 0 input ports with partial input delay specified.


11. checking partial_output_delay
---------------------------------
 There are 0 ports with partial output delay specified.


12. checking latch_loops
------------------------
 There are 0 combinational latch loops in the design through latch input



------------------------------------------------------------------------------------------------
| Design Timing Summary
| ---------------------
------------------------------------------------------------------------------------------------

    WNS(ns)      TNS(ns)  TNS Failing Endpoints  TNS Total Endpoints      WHS(ns)      THS(ns)  THS Failing Endpoints  THS Total Endpoints     WPWS(ns)     TPWS(ns)  TPWS Failing Endpoints  TPWS Total Endpoints  
    -------      -------  ---------------------  -------------------      -------      -------  ---------------------  -------------------     --------     --------  ----------------------  --------------------  
      0.096        0.000                      0               794067        0.050        0.000                      0               794022        0.001        0.000                       0                319224  


All user specified timing constraints are met.


------------------------------------------------------------------------------------------------
| Clock Summary
| -------------
------------------------------------------------------------------------------------------------

Clock                                                                                                                                                               Waveform(ns)         Period(ns)      Frequency(MHz)
-----                                                                                                                                                               ------------         ----------      --------------
async_in_clk                                                                                                                                                        {0.000 25.000}       50.000          20.000          
async_out_clk                                                                                                                                                       {0.000 25.000}       50.000          20.000          
bus_clk                                                                                                                                                             {0.000 2.500}        5.000           200.000         
clk100                                                                                                                                                              {0.000 5.000}        10.000          100.000         
clk40                                                                                                                                                               {0.000 12.500}       25.000          40.000          
ddr3_ext_refclk                                                                                                                                                     {0.000 5.000}        10.000          100.000         
  freq_refclk_1                                                                                                                                                     {1.442 2.212}        1.538           650.000         
    u_memc_ui_top_axi/mem_intfc0/ddr_phy_top0/u_ddr_mc_phy_wrapper/u_ddr_mc_phy/ddr_phy_4lanes_0.u_ddr_phy_4lanes/ddr_byte_lane_A.ddr_byte_lane_A/iserdes_clk_1     {1.442 2.212}        1.538           650.000         
      iserdes_clkdiv_4                                                                                                                                              {1.442 2.981}        3.077           325.000         
    u_memc_ui_top_axi/mem_intfc0/ddr_phy_top0/u_ddr_mc_phy_wrapper/u_ddr_mc_phy/ddr_phy_4lanes_0.u_ddr_phy_4lanes/ddr_byte_lane_B.ddr_byte_lane_B/iserdes_clk_1     {1.442 2.212}        1.538           650.000         
      iserdes_clkdiv_5                                                                                                                                              {1.442 2.981}        3.077           325.000         
    u_memc_ui_top_axi/mem_intfc0/ddr_phy_top0/u_ddr_mc_phy_wrapper/u_ddr_mc_phy/ddr_phy_4lanes_0.u_ddr_phy_4lanes/ddr_byte_lane_C.ddr_byte_lane_C/iserdes_clk_1     {1.442 2.212}        1.538           650.000         
      iserdes_clkdiv_6                                                                                                                                              {1.442 2.981}        3.077           325.000         
    u_memc_ui_top_axi/mem_intfc0/ddr_phy_top0/u_ddr_mc_phy_wrapper/u_ddr_mc_phy/ddr_phy_4lanes_0.u_ddr_phy_4lanes/ddr_byte_lane_D.ddr_byte_lane_D/iserdes_clk_1     {1.442 2.212}        1.538           650.000         
      iserdes_clkdiv_7                                                                                                                                              {1.442 2.981}        3.077           325.000         
  mem_refclk_1                                                                                                                                                      {0.000 0.769}        1.538           650.000         
    oserdes_clk_10                                                                                                                                                  {0.000 0.769}        1.538           650.000         
      oserdes_clkdiv_10                                                                                                                                             {0.000 1.538}        3.077           325.000         
    oserdes_clk_11                                                                                                                                                  {0.000 0.769}        1.538           650.000         
      oserdes_clkdiv_11                                                                                                                                             {0.000 1.538}        3.077           325.000         
    oserdes_clk_12                                                                                                                                                  {0.000 0.769}        1.538           650.000         
      oserdes_clkdiv_12                                                                                                                                             {0.000 3.077}        6.154           162.500         
    oserdes_clk_13                                                                                                                                                  {0.000 0.769}        1.538           650.000         
      oserdes_clkdiv_13                                                                                                                                             {0.000 3.077}        6.154           162.500         
    oserdes_clk_14                                                                                                                                                  {0.000 0.769}        1.538           650.000         
      oserdes_clkdiv_14                                                                                                                                             {0.000 3.077}        6.154           162.500         
    oserdes_clk_15                                                                                                                                                  {0.000 0.769}        1.538           650.000         
      oserdes_clkdiv_15                                                                                                                                             {0.000 3.077}        6.154           162.500         
    oserdes_clk_8                                                                                                                                                   {0.000 0.769}        1.538           650.000         
      oserdes_clkdiv_8                                                                                                                                              {0.000 1.538}        3.077           325.000         
    oserdes_clk_9                                                                                                                                                   {0.000 0.769}        1.538           650.000         
      oserdes_clkdiv_9                                                                                                                                              {0.000 1.538}        3.077           325.000         
  pll_clk3_out_1                                                                                                                                                    {0.000 3.077}        6.154           162.500         
    ddr3_ui_clk                                                                                                                                                     {0.000 3.077}        6.154           162.500         
    ddr3_ui_clk_2x                                                                                                                                                  {0.000 6.154}        12.308          81.250          
  pll_clkfbout_1                                                                                                                                                    {0.000 5.000}        10.000          100.000         
  sync_pulse_1                                                                                                                                                      {0.673 2.212}        24.615          40.625          
fpga_clk_a                                                                                                                                                          {0.000 3.255}        6.510           153.610         
  radio_clk                                                                                                                                                         {0.000 3.255}        6.510           153.610         
    atr_bus_clk                                                                                                                                                     {0.000 6.510}        13.020          76.805          
    dsa_bus_clk                                                                                                                                                     {0.000 6.510}        13.020          76.805          
    fp_gpio_bus_clk                                                                                                                                                 {0.000 6.510}        13.020          76.805          
    pl_spi_clk_a                                                                                                                                                    {0.000 162.750}      325.500         3.072           
    pl_spi_clk_b                                                                                                                                                    {0.000 162.750}      325.500         3.072           
  radio_clk_fb                                                                                                                                                      {0.000 3.255}        6.510           153.610         
fpga_clk_a_v                                                                                                                                                        {0.000 3.255}        6.510           153.610         
fpga_clk_b                                                                                                                                                          {0.000 3.255}        6.510           153.610         
  radio_clk_b                                                                                                                                                       {0.000 3.255}        6.510           153.610         
  radio_clk_b_fb                                                                                                                                                    {0.000 3.255}        6.510           153.610         
fpga_clk_b_v                                                                                                                                                        {0.000 3.255}        6.510           153.610         
ge_phy_clk                                                                                                                                                          {0.000 4.000}        8.000           125.000         
meas_clk_ref                                                                                                                                                        {0.000 3.000}        6.000           166.667         
  ddr3_dma_clk_misc_clock_gen                                                                                                                                       {0.000 1.646}        3.291           303.819         
  meas_clk                                                                                                                                                          {0.000 2.520}        5.040           198.413         
  meas_clk_fb                                                                                                                                                       {0.000 9.000}        18.000          55.556          
mgt_clk_dba                                                                                                                                                         {0.000 3.255}        6.510           153.610         
mgt_clk_dbb                                                                                                                                                         {0.000 3.255}        6.510           153.610         
net_clk                                                                                                                                                             {0.000 4.000}        8.000           125.000         
ref_clk                                                                                                                                                             {0.000 20.000}       40.000          25.000          
sfp_wrapper_0/lanes[0].lane_i/mgt_io_i/one_gige_phy_i/core_support_i/pcs_pma_i/inst/transceiver_inst/gtwizard_inst/inst/gtwizard_i/gt0_GTWIZARD_i/gtxe2_i/RXOUTCLK  {0.000 8.000}        16.000          62.500          
sfp_wrapper_0/lanes[0].lane_i/mgt_io_i/one_gige_phy_i/core_support_i/pcs_pma_i/inst/transceiver_inst/gtwizard_inst/inst/gtwizard_i/gt0_GTWIZARD_i/gtxe2_i/TXOUTCLK  {0.000 8.000}        16.000          62.500          
  clkfbout                                                                                                                                                          {0.000 8.000}        16.000          62.500          
  clkout0                                                                                                                                                           {0.000 4.000}        8.000           125.000         
  clkout1                                                                                                                                                           {0.000 8.000}        16.000          62.500          
sfp_wrapper_1/lanes[0].lane_i/mgt_io_i/ten_gige_phy_i/ten_gig_eth_pcs_pma_i/inst/gt0_gtwizard_10gbaser_multi_gt_i/gt0_gtwizard_10gbaser_i/gtxe2_i/RXOUTCLK          {0.000 1.551}        3.103           322.269         
sfp_wrapper_1/lanes[0].lane_i/mgt_io_i/ten_gige_phy_i/ten_gig_eth_pcs_pma_i/inst/gt0_gtwizard_10gbaser_multi_gt_i/gt0_gtwizard_10gbaser_i/gtxe2_i/TXOUTCLK          {0.000 1.551}        3.103           322.269         
xge_clk                                                                                                                                                             {0.000 3.200}        6.400           156.250         
  dclk_buf                                                                                                                                                          {0.000 6.400}        12.800          78.125          


------------------------------------------------------------------------------------------------
| Intra Clock Table
| -----------------
------------------------------------------------------------------------------------------------

Clock                                                                                                                                                                   WNS(ns)      TNS(ns)  TNS Failing Endpoints  TNS Total Endpoints      WHS(ns)      THS(ns)  THS Failing Endpoints  THS Total Endpoints     WPWS(ns)     TPWS(ns)  TPWS Failing Endpoints  TPWS Total Endpoints  
-----                                                                                                                                                                   -------      -------  ---------------------  -------------------      -------      -------  ---------------------  -------------------     --------     --------  ----------------------  --------------------  
bus_clk                                                                                                                                                                   0.106        0.000                      0               530224        0.050        0.000                      0               530224        0.264        0.000                       0                214887  
clk40                                                                                                                                                                     6.410        0.000                      0                75739        0.052        0.000                      0                75739       11.500        0.000                       0                 31943  
ddr3_ext_refclk                                                                                                                                                                                                                                                                                                       3.000        0.000                       0                     1  
  freq_refclk_1                                                                                                                                                                                                                                                                                                       0.287        0.000                       0                    15  
    u_memc_ui_top_axi/mem_intfc0/ddr_phy_top0/u_ddr_mc_phy_wrapper/u_ddr_mc_phy/ddr_phy_4lanes_0.u_ddr_phy_4lanes/ddr_byte_lane_A.ddr_byte_lane_A/iserdes_clk_1                                                                                                                                                       0.468        0.000                       0                    16  
      iserdes_clkdiv_4                                                                                                                                                    1.466        0.000                      0                   33        0.070        0.000                      0                   33        0.624        0.000                       0                     9  
    u_memc_ui_top_axi/mem_intfc0/ddr_phy_top0/u_ddr_mc_phy_wrapper/u_ddr_mc_phy/ddr_phy_4lanes_0.u_ddr_phy_4lanes/ddr_byte_lane_B.ddr_byte_lane_B/iserdes_clk_1                                                                                                                                                       0.468        0.000                       0                    16  
      iserdes_clkdiv_5                                                                                                                                                    1.549        0.000                      0                   33        0.070        0.000                      0                   33        0.624        0.000                       0                     9  
    u_memc_ui_top_axi/mem_intfc0/ddr_phy_top0/u_ddr_mc_phy_wrapper/u_ddr_mc_phy/ddr_phy_4lanes_0.u_ddr_phy_4lanes/ddr_byte_lane_C.ddr_byte_lane_C/iserdes_clk_1                                                                                                                                                       0.468        0.000                       0                    16  
      iserdes_clkdiv_6                                                                                                                                                    1.504        0.000                      0                   33        0.070        0.000                      0                   33        0.624        0.000                       0                     9  
    u_memc_ui_top_axi/mem_intfc0/ddr_phy_top0/u_ddr_mc_phy_wrapper/u_ddr_mc_phy/ddr_phy_4lanes_0.u_ddr_phy_4lanes/ddr_byte_lane_D.ddr_byte_lane_D/iserdes_clk_1                                                                                                                                                       0.468        0.000                       0                    16  
      iserdes_clkdiv_7                                                                                                                                                    1.561        0.000                      0                   33        0.070        0.000                      0                   33        0.624        0.000                       0                     9  
  mem_refclk_1                                                                                                                                                            0.461        0.000                      0                    2        0.324        0.000                      0                    2        0.234        0.000                       0                    15  
    oserdes_clk_10                                                                                                                                                        0.474        0.000                      0                    4        0.371        0.000                      0                    4        0.468        0.000                       0                    12  
      oserdes_clkdiv_10                                                                                                                                                   2.083        0.000                      0                   36        0.066        0.000                      0                   36        0.624        0.000                       0                    11  
    oserdes_clk_11                                                                                                                                                        0.486        0.000                      0                    4        0.364        0.000                      0                    4        0.468        0.000                       0                    12  
      oserdes_clkdiv_11                                                                                                                                                   1.895        0.000                      0                   36        0.062        0.000                      0                   36        0.624        0.000                       0                    11  
    oserdes_clk_12                                                                                                                                                                                                                                                                                                    0.468        0.000                       0                     1  
      oserdes_clkdiv_12                                                                                                                                                   5.169        0.000                      0                    4        0.072        0.000                      0                    4        2.163        0.000                       0                     2  
    oserdes_clk_13                                                                                                                                                                                                                                                                                                    0.468        0.000                       0                     8  
      oserdes_clkdiv_13                                                                                                                                                   5.159        0.000                      0                   28        0.072        0.000                      0                   28        2.163        0.000                       0                     8  
    oserdes_clk_14                                                                                                                                                                                                                                                                                                    0.468        0.000                       0                     7  
      oserdes_clkdiv_14                                                                                                                                                   5.160        0.000                      0                   28        0.070        0.000                      0                   28        2.163        0.000                       0                     8  
    oserdes_clk_15                                                                                                                                                                                                                                                                                                    0.468        0.000                       0                    10  
      oserdes_clkdiv_15                                                                                                                                                   4.972        0.000                      0                   40        0.062        0.000                      0                   40        2.163        0.000                       0                    11  
    oserdes_clk_8                                                                                                                                                         0.479        0.000                      0                    4        0.369        0.000                      0                    4        0.468        0.000                       0                    12  
      oserdes_clkdiv_8                                                                                                                                                    2.092        0.000                      0                   36        0.064        0.000                      0                   36        0.624        0.000                       0                    11  
    oserdes_clk_9                                                                                                                                                         0.466        0.000                      0                    4        0.375        0.000                      0                    4        0.468        0.000                       0                    12  
      oserdes_clkdiv_9                                                                                                                                                    2.082        0.000                      0                   36        0.068        0.000                      0                   36        0.624        0.000                       0                    11  
  pll_clk3_out_1                                                                                                                                                                                                                                                                                                      1.577        0.000                       0                     3  
    ddr3_ui_clk                                                                                                                                                           0.691        0.000                      0                51148        0.051        0.000                      0                51148        1.827        0.000                       0                 21270  
    ddr3_ui_clk_2x                                                                                                                                                        3.928        0.000                      0                   16        0.118        0.000                      0                   16        5.804        0.000                       0                    20  
  pll_clkfbout_1                                                                                                                                                                                                                                                                                                      8.929        0.000                       0                     2  
  sync_pulse_1                                                                                                                                                                                                                                                                                                        0.466        0.000                       0                    15  
fpga_clk_a                                                                                                                                                                                                                                                                                                            1.755        0.000                       0                     1  
  radio_clk                                                                                                                                                               0.340        0.000                      0                53371        0.055        0.000                      0                53371        2.487        0.000                       0                 25021  
  radio_clk_fb                                                                                                                                                                                                                                                                                                        5.102        0.000                       0                     3  
fpga_clk_b                                                                                                                                                                                                                                                                                                            1.755        0.000                       0                     1  
  radio_clk_b                                                                                                                                                             0.613        0.000                      0                  202        0.070        0.000                      0                  202        2.855        0.000                       0                   147  
  radio_clk_b_fb                                                                                                                                                                                                                                                                                                      5.102        0.000                       0                     3  
meas_clk_ref                                                                                                                                                                                                                                                                                                          1.500        0.000                       0                     2  
  ddr3_dma_clk_misc_clock_gen                                                                                                                                             0.130        0.000                      0                42512        0.051        0.000                      0                42512        0.878        0.000                       0                 16609  
  meas_clk                                                                                                                                                                0.596        0.000                      0                 3418        0.057        0.000                      0                 3418        2.120        0.000                       0                  1813  
  meas_clk_fb                                                                                                                                                                                                                                                                                                        16.929        0.000                       0                     2  
mgt_clk_dba                                                                                                                                                               6.077        0.000                      0                    1        0.149        0.000                      0                    1        2.855        0.000                       0                     9  
mgt_clk_dbb                                                                                                                                                               5.722        0.000                      0                    1        0.322        0.000                      0                    1        2.855        0.000                       0                     9  
net_clk                                                                                                                                                                   7.029        0.000                      0                    7        0.172        0.000                      0                    7        2.286        0.000                       0                    13  
ref_clk                                                                                                                                                                   1.192        0.000                      0                 1090        0.108        0.000                      0                 1090       19.600        0.000                       0                   797  
sfp_wrapper_0/lanes[0].lane_i/mgt_io_i/one_gige_phy_i/core_support_i/pcs_pma_i/inst/transceiver_inst/gtwizard_inst/inst/gtwizard_i/gt0_GTWIZARD_i/gtxe2_i/TXOUTCLK                                                                                                                                                    5.000        0.000                       0                     3  
  clkfbout                                                                                                                                                                                                                                                                                                           14.929        0.000                       0                     2  
  clkout0                                                                                                                                                                 1.695        0.000                      0                 2235        0.059        0.000                      0                 2235        3.358        0.000                       0                  1067  
  clkout1                                                                                                                                                                13.515        0.000                      0                  156        0.151        0.000                      0                  156        7.600        0.000                       0                   124  
sfp_wrapper_1/lanes[0].lane_i/mgt_io_i/ten_gige_phy_i/ten_gig_eth_pcs_pma_i/inst/gt0_gtwizard_10gbaser_multi_gt_i/gt0_gtwizard_10gbaser_i/gtxe2_i/RXOUTCLK                0.096        0.000                      0                 3774        0.079        0.000                      0                 3774        0.001        0.000                       0                  1464  
sfp_wrapper_1/lanes[0].lane_i/mgt_io_i/ten_gige_phy_i/ten_gig_eth_pcs_pma_i/inst/gt0_gtwizard_10gbaser_multi_gt_i/gt0_gtwizard_10gbaser_i/gtxe2_i/TXOUTCLK                0.862        0.000                      0                  339        0.108        0.000                      0                  339        0.001        0.000                       0                   203  
xge_clk                                                                                                                                                                   1.727        0.000                      0                 6501        0.053        0.000                      0                 6500        2.432        0.000                       0                  3390  
  dclk_buf                                                                                                                                                               10.127        0.000                      0                  185        0.108        0.000                      0                  185        6.000        0.000                       0                   123  


------------------------------------------------------------------------------------------------
| Inter Clock Table
| -----------------
------------------------------------------------------------------------------------------------

From Clock                                                                                                                                                   To Clock                                                                                                                                                         WNS(ns)      TNS(ns)  TNS Failing Endpoints  TNS Total Endpoints      WHS(ns)      THS(ns)  THS Failing Endpoints  THS Total Endpoints  
----------                                                                                                                                                   --------                                                                                                                                                         -------      -------  ---------------------  -------------------      -------      -------  ---------------------  -------------------  
                                                                                                                                                             async_out_clk                                                                                                                                                     40.778        0.000                      0                    4        3.075        0.000                      0                    4  
ref_clk                                                                                                                                                      async_out_clk                                                                                                                                                     41.943        0.000                      0                    2        3.702        0.000                      0                    2  
sfp_wrapper_1/lanes[0].lane_i/mgt_io_i/ten_gige_phy_i/ten_gig_eth_pcs_pma_i/inst/gt0_gtwizard_10gbaser_multi_gt_i/gt0_gtwizard_10gbaser_i/gtxe2_i/TXOUTCLK   async_out_clk                                                                                                                                                     35.701        0.000                      0                    1        7.896        0.000                      0                    1  
ddr3_ui_clk                                                                                                                                                  u_memc_ui_top_axi/mem_intfc0/ddr_phy_top0/u_ddr_mc_phy_wrapper/u_ddr_mc_phy/ddr_phy_4lanes_0.u_ddr_phy_4lanes/ddr_byte_lane_A.ddr_byte_lane_A/iserdes_clk_1        5.344        0.000                      0                    8       23.220        0.000                      0                    8  
ddr3_ui_clk                                                                                                                                                  u_memc_ui_top_axi/mem_intfc0/ddr_phy_top0/u_ddr_mc_phy_wrapper/u_ddr_mc_phy/ddr_phy_4lanes_0.u_ddr_phy_4lanes/ddr_byte_lane_B.ddr_byte_lane_B/iserdes_clk_1        4.359        0.000                      0                    8       23.373        0.000                      0                    8  
ddr3_ui_clk                                                                                                                                                  u_memc_ui_top_axi/mem_intfc0/ddr_phy_top0/u_ddr_mc_phy_wrapper/u_ddr_mc_phy/ddr_phy_4lanes_0.u_ddr_phy_4lanes/ddr_byte_lane_C.ddr_byte_lane_C/iserdes_clk_1        3.372        0.000                      0                    8       24.029        0.000                      0                    8  
ddr3_ui_clk                                                                                                                                                  u_memc_ui_top_axi/mem_intfc0/ddr_phy_top0/u_ddr_mc_phy_wrapper/u_ddr_mc_phy/ddr_phy_4lanes_0.u_ddr_phy_4lanes/ddr_byte_lane_D.ddr_byte_lane_D/iserdes_clk_1        2.415        0.000                      0                    8       24.560        0.000                      0                    8  
sync_pulse_1                                                                                                                                                 mem_refclk_1                                                                                                                                                       0.375        0.000                      0                    2        0.200        0.000                      0                    2  
oserdes_clk_10                                                                                                                                               oserdes_clkdiv_10                                                                                                                                                  0.789        0.000                      0                   15        0.075        0.000                      0                   15  
oserdes_clk_11                                                                                                                                               oserdes_clkdiv_11                                                                                                                                                  0.669        0.000                      0                   15        0.094        0.000                      0                   15  
oserdes_clk_12                                                                                                                                               oserdes_clkdiv_12                                                                                                                                                  0.789        0.000                      0                    2        0.094        0.000                      0                    2  
oserdes_clk_13                                                                                                                                               oserdes_clkdiv_13                                                                                                                                                  0.696        0.000                      0                    8        0.078        0.000                      0                    8  
oserdes_clk_14                                                                                                                                               oserdes_clkdiv_14                                                                                                                                                  0.772        0.000                      0                    8        0.094        0.000                      0                    8  
oserdes_clk_15                                                                                                                                               oserdes_clkdiv_15                                                                                                                                                  0.547        0.000                      0                   11        0.094        0.000                      0                   11  
oserdes_clk_8                                                                                                                                                oserdes_clkdiv_8                                                                                                                                                   0.606        0.000                      0                   15        0.073        0.000                      0                   15  
oserdes_clk_9                                                                                                                                                oserdes_clkdiv_9                                                                                                                                                   0.730        0.000                      0                   15        0.077        0.000                      0                   15  
ddr3_ui_clk_2x                                                                                                                                               ddr3_ui_clk                                                                                                                                                        3.639        0.000                      0                    5        0.159        0.000                      0                    5  
ddr3_ui_clk                                                                                                                                                  ddr3_ui_clk_2x                                                                                                                                                     2.228        0.000                      0                    1        1.263        0.000                      0                    1  
fp_gpio_bus_clk                                                                                                                                              radio_clk                                                                                                                                                         41.155        0.000                      0                    1        4.634        0.000                      0                    1  
pl_spi_clk_a                                                                                                                                                 radio_clk                                                                                                                                                         84.741        0.000                      0                    1       17.753        0.000                      0                    1  
pl_spi_clk_b                                                                                                                                                 radio_clk                                                                                                                                                         85.830        0.000                      0                    1       17.087        0.000                      0                    1  
fpga_clk_a_v                                                                                                                                                 radio_clk                                                                                                                                                          0.848        0.000                      0                    1        1.152        0.000                      0                    1  
radio_clk_b                                                                                                                                                  radio_clk                                                                                                                                                          4.785        0.000                      0                    1        0.074        0.000                      0                    1  
radio_clk                                                                                                                                                    atr_bus_clk                                                                                                                                                        1.366        0.000                      0                    7        0.361        0.000                      0                    7  
radio_clk                                                                                                                                                    dsa_bus_clk                                                                                                                                                        0.290        0.000                      0                   47        0.261        0.000                      0                   47  
radio_clk                                                                                                                                                    fp_gpio_bus_clk                                                                                                                                                    3.505        0.000                      0                   11        1.442        0.000                      0                   11  
radio_clk                                                                                                                                                    pl_spi_clk_a                                                                                                                                                       8.814        0.000                      0                    4        8.168        0.000                      0                    4  
radio_clk                                                                                                                                                    pl_spi_clk_b                                                                                                                                                       9.018        0.000                      0                    4        8.182        0.000                      0                    4  
radio_clk                                                                                                                                                    fpga_clk_a_v                                                                                                                                                       0.260        0.000                      0                    1        0.565        0.000                      0                    1  
fpga_clk_b_v                                                                                                                                                 radio_clk_b                                                                                                                                                        1.152        0.000                      0                    1        0.918        0.000                      0                    1  
clkout1                                                                                                                                                      clkout0                                                                                                                                                            5.805        0.000                      0                   28        0.066        0.000                      0                   28  
clkout0                                                                                                                                                      clkout1                                                                                                                                                            5.475        0.000                      0                   24        0.090        0.000                      0                   24  
dclk_buf                                                                                                                                                     xge_clk                                                                                                                                                            2.351        0.000                      0                   16                                                                        
xge_clk                                                                                                                                                      dclk_buf                                                                                                                                                           2.294        0.000                      0                   26                                                                        


------------------------------------------------------------------------------------------------
| Other Path Groups Table
| -----------------------
------------------------------------------------------------------------------------------------

Path Group                                                                                                                                                  From Clock                                                                                                                                                  To Clock                                                                                                                                                        WNS(ns)      TNS(ns)  TNS Failing Endpoints  TNS Total Endpoints      WHS(ns)      THS(ns)  THS Failing Endpoints  THS Total Endpoints  
----------                                                                                                                                                  ----------                                                                                                                                                  --------                                                                                                                                                        -------      -------  ---------------------  -------------------      -------      -------  ---------------------  -------------------  
**async_default**                                                                                                                                           bus_clk                                                                                                                                                     bus_clk                                                                                                                                                           0.949        0.000                      0                13396        0.093        0.000                      0                13396  
**async_default**                                                                                                                                           clk40                                                                                                                                                       clk40                                                                                                                                                            21.390        0.000                      0                 3101        0.058        0.000                      0                 3101  
**async_default**                                                                                                                                           clkout0                                                                                                                                                     clkout0                                                                                                                                                           5.563        0.000                      0                    2        0.640        0.000                      0                    2  
**async_default**                                                                                                                                           ddr3_dma_clk_misc_clock_gen                                                                                                                                 ddr3_dma_clk_misc_clock_gen                                                                                                                                       0.539        0.000                      0                 2143        0.116        0.000                      0                 2143  
**async_default**                                                                                                                                           ddr3_ui_clk                                                                                                                                                 ddr3_ui_clk                                                                                                                                                       3.527        0.000                      0                  499        0.217        0.000                      0                  499  
**async_default**                                                                                                                                           radio_clk                                                                                                                                                   radio_clk                                                                                                                                                         3.902        0.000                      0                 2238        0.186        0.000                      0                 2238  
**async_default**                                                                                                                                           sfp_wrapper_1/lanes[0].lane_i/mgt_io_i/ten_gige_phy_i/ten_gig_eth_pcs_pma_i/inst/gt0_gtwizard_10gbaser_multi_gt_i/gt0_gtwizard_10gbaser_i/gtxe2_i/TXOUTCLK  sfp_wrapper_1/lanes[0].lane_i/mgt_io_i/ten_gige_phy_i/ten_gig_eth_pcs_pma_i/inst/gt0_gtwizard_10gbaser_multi_gt_i/gt0_gtwizard_10gbaser_i/gtxe2_i/TXOUTCLK        2.256        0.000                      0                    1        0.300        0.000                      0                    1  
**async_default**                                                                                                                                           xge_clk                                                                                                                                                     xge_clk                                                                                                                                                           1.802        0.000                      0                 1045        1.321        0.000                      0                 1045  
**default**                                                                                                                                                                                                                                                                                                                                                                                                                                                                               1.694        0.000                      0                   18        0.929        0.000                      0                   18  
**default**                                                                                                                                                 ddr3_ui_clk                                                                                                                                                                                                                                                                                                                   3.188        0.000                      0                    2                                                                        
**default**                                                                                                                                                 input port clock                                                                                                                                                                                                                                                                                                              1.598        0.000                      0                    2        1.745        0.000                      0                    2  


