module github.com/cilium/tetragon/pkg/k8s

// renovate: datasource=golang-version depName=go
go 1.23.0

toolchain go1.23.1

require (
	github.com/blang/semver/v4 v4.0.0
	github.com/cilium/cilium v1.17.0-pre.3
	github.com/sirupsen/logrus v1.9.3
	golang.org/x/sync v0.10.0
	k8s.io/apiextensions-apiserver v0.32.0-rc.0
	k8s.io/apimachinery v0.32.0-rc.0
	k8s.io/client-go v0.32.0-rc.0
	k8s.io/code-generator v0.32.0-rc.0
	sigs.k8s.io/controller-tools v0.16.5
	sigs.k8s.io/yaml v1.4.0
)

require (
	github.com/davecgh/go-spew v1.1.2-0.20180830191138-d8f796af33cc // indirect
	github.com/emicklei/go-restful/v3 v3.12.0 // indirect
	github.com/fatih/color v1.18.0 // indirect
	github.com/fxamacker/cbor/v2 v2.7.0 // indirect
	github.com/go-logr/logr v1.4.2 // indirect
	github.com/go-openapi/jsonpointer v0.21.0 // indirect
	github.com/go-openapi/jsonreference v0.21.0 // indirect
	github.com/go-openapi/swag v0.23.0 // indirect
	github.com/gobuffalo/flect v1.0.3 // indirect
	github.com/gogo/protobuf v1.3.2 // indirect
	github.com/golang/protobuf v1.5.4 // indirect
	github.com/google/gnostic-models v0.6.8 // indirect
	github.com/google/go-cmp v0.6.0 // indirect
	github.com/google/gofuzz v1.2.0 // indirect
	github.com/google/uuid v1.6.0 // indirect
	github.com/inconshreveable/mousetrap v1.1.0 // indirect
	github.com/josharian/intern v1.0.0 // indirect
	github.com/json-iterator/go v1.1.12 // indirect
	github.com/mailru/easyjson v0.7.7 // indirect
	github.com/mattn/go-colorable v0.1.13 // indirect
	github.com/mattn/go-isatty v0.0.20 // indirect
	github.com/modern-go/concurrent v0.0.0-20180306012644-bacd9c7ef1dd // indirect
	github.com/modern-go/reflect2 v1.0.2 // indirect
	github.com/munnerz/goautoneg v0.0.0-20191010083416-a7dc8b61c822 // indirect
	github.com/petermattis/goid v0.0.0-20240813172612-4fcff4a6cae7 // indirect
	github.com/pkg/errors v0.9.1 // indirect
	github.com/sasha-s/go-deadlock v0.3.5 // indirect
	github.com/spf13/cobra v1.8.1 // indirect
	github.com/spf13/pflag v1.0.6-0.20210604193023-d5e0c0615ace // indirect
	github.com/x448/float16 v0.8.4 // indirect
	golang.org/x/mod v0.22.0 // indirect
	golang.org/x/net v0.31.0 // indirect
	golang.org/x/oauth2 v0.23.0 // indirect
	golang.org/x/sys v0.27.0 // indirect
	golang.org/x/term v0.26.0 // indirect
	golang.org/x/text v0.20.0 // indirect
	golang.org/x/time v0.8.0 // indirect
	golang.org/x/tools v0.27.0 // indirect
	google.golang.org/protobuf v1.35.2 // indirect
	gopkg.in/evanphx/json-patch.v4 v4.12.0 // indirect
	gopkg.in/inf.v0 v0.9.1 // indirect
	gopkg.in/yaml.v2 v2.4.0 // indirect
	gopkg.in/yaml.v3 v3.0.1 // indirect
	k8s.io/api v0.32.0-rc.0 // indirect
	k8s.io/gengo/v2 v2.0.0-20240911193312-2b36238f13e9 // indirect
	k8s.io/klog/v2 v2.130.1 // indirect
	k8s.io/kube-openapi v0.0.0-20241105132330-32ad38e42d3f // indirect
	k8s.io/utils v0.0.0-20241104163129-6fe5fd82f078 // indirect
	sigs.k8s.io/json v0.0.0-20241010143419-9aa6b5e7a4b3 // indirect
	sigs.k8s.io/structured-merge-diff/v4 v4.4.2 // indirect
)

// See main go.mod for more about this replace directive
replace go.universe.tf/metallb => github.com/cilium/metallb v0.1.1-0.20220829170633-5d7dfb1129f7
