module github.com/bishopfox/sliver

go 1.18

replace github.com/desertbit/grumble v1.1.1 => github.com/moloch--/grumble v1.1.6

require (
	filippo.io/age v1.1.1
	github.com/AlecAivazis/survey/v2 v2.3.6
	github.com/Binject/binjection v0.0.0-20200705191933-da1a50d7013d
	github.com/Binject/debug v0.0.0-20210312092933-6277045c2fdf
	github.com/Binject/go-donut v0.0.0-20210701074227-67a31e2d883e
	github.com/Binject/universal v0.0.0-20210304094126-daefaa886313
	github.com/Ne0nd0g/go-clr v1.0.3
	github.com/alecthomas/chroma v0.10.0
	github.com/cheggaaa/pb/v3 v3.1.2
	github.com/chromedp/cdproto v0.0.0-20230220211738-2b1ec77315c9
	github.com/chromedp/chromedp v0.9.1
	github.com/desertbit/columnize v2.1.0+incompatible
	github.com/desertbit/go-shlex v0.1.1
	github.com/desertbit/grumble v1.1.1
	github.com/desertbit/readline v1.5.1
	github.com/fatih/color v1.15.0
	github.com/gofrs/uuid v4.4.0+incompatible
	github.com/google/uuid v1.3.0
	github.com/gorilla/mux v1.8.0
	github.com/grpc-ecosystem/go-grpc-middleware v1.4.0
	github.com/jedib0t/go-pretty/v6 v6.4.6
	github.com/kbinani/screenshot v0.0.0-20191211154542-3a185f1ce18f
	github.com/lesnuages/go-winio v0.4.19
	github.com/lesnuages/snitch v0.6.0
	github.com/mattn/go-sqlite3 v1.14.16
	github.com/miekg/dns v1.1.54
	github.com/moloch--/memmod v0.0.0-20211120144554-8b37cc654945
	github.com/pquerna/otp v1.4.0
	github.com/sirupsen/logrus v1.9.2
	github.com/spf13/cobra v1.7.0
	github.com/stretchr/testify v1.8.1
	github.com/things-go/go-socks5 v0.0.3
	github.com/xlab/treeprint v1.2.0
	github.com/yiya1989/sshkrb5 v0.0.0-20201110125252-a1455b75a35e
	golang.org/x/crypto v0.9.0
	golang.org/x/net v0.10.0
	golang.org/x/sys v0.8.0
	golang.org/x/term v0.8.0
	golang.org/x/text v0.9.0
	golang.zx2c4.com/wireguard v0.0.0-20220316235147-5aff28b14c24
	golang.zx2c4.com/wireguard/wgctrl v0.0.0-20220208144051-fde48d68ee68
	google.golang.org/grpc v1.55.0
	google.golang.org/protobuf v1.30.0
	gopkg.in/AlecAivazis/survey.v1 v1.8.8
	gorm.io/driver/mysql v1.5.1
	gorm.io/driver/postgres v1.5.2
	gorm.io/driver/sqlite v1.5.1
	gorm.io/gorm v1.25.1
	gvisor.dev/gvisor v0.0.0-20220817001344-846276b3dbc5
	modernc.org/sqlite v1.22.1
)

require (
	github.com/Binject/shellcode v0.0.0-20191101084904-a8a90e7d4563 // indirect
	github.com/BurntSushi/xgb v0.0.0-20201008132610-5f9e7b3c49cd // indirect
	github.com/Microsoft/go-winio v0.5.1 // indirect
	github.com/VirusTotal/vt-go v0.0.0-20210528074736-45bbe34cc8ab // indirect
	github.com/VividCortex/ewma v1.2.0 // indirect
	github.com/awgh/cppgo v0.0.0-20210224085512-3d24bca8edc0 // indirect
	github.com/awgh/rawreader v0.0.0-20200626064944-56820a9c6da4 // indirect
	github.com/boombuler/barcode v1.0.1-0.20190219062509-6c824513bacc // indirect
	github.com/chromedp/sysutil v1.0.0 // indirect
	github.com/davecgh/go-spew v1.1.1 // indirect
	github.com/demisto/goxforce v0.0.0-20160322194047-db8357535b1d // indirect
	github.com/desertbit/closer/v3 v3.1.2 // indirect
	github.com/dlclark/regexp2 v1.4.0 // indirect
	github.com/dustin/go-humanize v1.0.1 // indirect
	github.com/gen2brain/shm v0.0.0-20200228170931-49f9650110c5 // indirect
	github.com/go-sql-driver/mysql v1.7.0 // indirect
	github.com/gobwas/httphead v0.1.0 // indirect
	github.com/gobwas/pool v0.2.1 // indirect
	github.com/gobwas/ws v1.1.0 // indirect
	github.com/golang/protobuf v1.5.3 // indirect
	github.com/google/btree v1.0.1 // indirect
	github.com/hashicorp/errwrap v1.1.0 // indirect
	github.com/hashicorp/go-multierror v1.1.1 // indirect
	github.com/hashicorp/go-uuid v1.0.2 // indirect
	github.com/inconshreveable/mousetrap v1.1.0 // indirect
	github.com/jackc/pgpassfile v1.0.0 // indirect
	github.com/jackc/pgservicefile v0.0.0-20221227161230-091c0ba34f0a // indirect
	github.com/jackc/pgx/v5 v5.3.1 // indirect
	github.com/jcmturner/gofork v1.0.0 // indirect
	github.com/jinzhu/inflection v1.0.0 // indirect
	github.com/jinzhu/now v1.1.5 // indirect
	github.com/josharian/intern v1.0.0 // indirect
	github.com/kballard/go-shellquote v0.0.0-20180428030007-95032a82bc51 // indirect
	github.com/lxn/win v0.0.0-20210218163916-a377121e959e // indirect
	github.com/mailru/easyjson v0.7.7 // indirect
	github.com/mattn/go-colorable v0.1.13 // indirect
	github.com/mattn/go-isatty v0.0.17 // indirect
	github.com/mattn/go-runewidth v0.0.13 // indirect
	github.com/mgutz/ansi v0.0.0-20170206155736-9520e82c474b // indirect
	github.com/pmezard/go-difflib v1.0.0 // indirect
	github.com/remyoudompheng/bigfft v0.0.0-20230129092748-24d4a6f8daec // indirect
	github.com/rivo/uniseg v0.2.0 // indirect
	github.com/rogpeppe/go-internal v1.10.0 // indirect
	github.com/spf13/pflag v1.0.5 // indirect
	github.com/thedevsaddam/gojsonq/v2 v2.5.2 // indirect
	golang.org/x/mod v0.8.0 // indirect
	golang.org/x/time v0.0.0-20210220033141-f8bda1e9f3ba // indirect
	golang.org/x/tools v0.6.0 // indirect
	golang.zx2c4.com/wintun v0.0.0-20211104114900-415007cec224 // indirect
	google.golang.org/genproto v0.0.0-20230306155012-7f2fa6fef1f4 // indirect
	gopkg.in/jcmturner/aescts.v1 v1.0.1 // indirect
	gopkg.in/jcmturner/dnsutils.v1 v1.0.1 // indirect
	gopkg.in/jcmturner/goidentity.v3 v3.0.0 // indirect
	gopkg.in/jcmturner/gokrb5.v7 v7.5.0 // indirect
	gopkg.in/jcmturner/rpc.v1 v1.1.0 // indirect
	gopkg.in/yaml.v3 v3.0.1 // indirect
	lukechampine.com/uint128 v1.2.0 // indirect
	modernc.org/cc/v3 v3.40.0 // indirect
	modernc.org/ccgo/v3 v3.16.13 // indirect
	modernc.org/libc v1.22.5 // indirect
	modernc.org/mathutil v1.5.0 // indirect
	modernc.org/memory v1.5.0 // indirect
	modernc.org/opt v0.1.3 // indirect
	modernc.org/strutil v1.1.3 // indirect
	modernc.org/token v1.0.1 // indirect
)
