module github.com/slimtoolkit/slim

go 1.21

require (
	github.com/armon/go-radix v1.0.0
	github.com/bmatcuk/doublestar v1.3.4
	github.com/bmatcuk/doublestar/v3 v3.0.0
	github.com/c-bata/go-prompt v0.2.3
	github.com/c4milo/unpackit v0.0.0-20170704181138-4ed373e9ef1c
	github.com/cespare/xxhash/v2 v2.2.0
	github.com/compose-spec/compose-go v0.0.0-20210916141509-a7e1bc322970
	github.com/docker/docker v24.0.7+incompatible
	github.com/docker/go-connections v0.4.0
	github.com/dustin/go-humanize v1.0.0
	github.com/fatih/color v1.13.0
	github.com/fsouza/go-dockerclient v1.10.0
	github.com/getkin/kin-openapi v0.76.0
	github.com/ghodss/yaml v1.0.0
	github.com/gocolly/colly/v2 v2.1.0
	github.com/google/go-containerregistry v0.19.0
	github.com/google/shlex v0.0.0-20191202100458-e7afc7fbc510
	github.com/gorilla/websocket v1.4.2
	github.com/jedib0t/go-pretty/v6 v6.4.9
	github.com/moby/term v0.5.0
	github.com/opencontainers/image-spec v1.1.0-rc5
	github.com/pkg/errors v0.9.1
	github.com/segmentio/ksuid v1.0.4
	github.com/sirupsen/logrus v1.9.3
	github.com/slimtoolkit/go-update v0.0.0-20231119011834-99945ebd76f7
	github.com/slimtoolkit/uiprogress v0.0.0-20231119012247-4a052fb12f37
	github.com/syndtr/gocapability v0.0.0-20200815063812-42c35b437635
	github.com/urfave/cli/v2 v2.3.0
	golang.org/x/crypto v0.17.0
	golang.org/x/net v0.18.0
	golang.org/x/sys v0.15.0
	k8s.io/api v0.27.3
	k8s.io/apimachinery v0.27.3
	k8s.io/cli-runtime v0.27.3
	k8s.io/client-go v0.27.3
)

require (
	github.com/Azure/go-ansiterm v0.0.0-20230124172434-306776ec8161 // indirect
	github.com/Microsoft/go-winio v0.6.1 // indirect
	github.com/bradfitz/iter v0.0.0-20191230175014-e8f45d346db8 // indirect
	github.com/containerd/stargz-snapshotter/estargz v0.14.3 // indirect
	github.com/cpuguy83/go-md2man/v2 v2.0.2 // indirect
	github.com/distribution/distribution/v3 v3.0.0-20210316161203-a01c71e2477e // indirect
	github.com/docker/cli v24.0.0+incompatible // indirect
	github.com/docker/distribution v2.8.2+incompatible // indirect
	github.com/docker/docker-credential-helpers v0.7.0 // indirect
	github.com/docker/go-units v0.5.0 // indirect
	github.com/emicklei/go-restful/v3 v3.10.1 // indirect
	github.com/evanphx/json-patch v4.12.0+incompatible // indirect
	github.com/go-errors/errors v1.4.2 // indirect
	github.com/go-logr/logr v1.2.4 // indirect
	github.com/go-openapi/jsonpointer v0.19.6 // indirect
	github.com/go-openapi/jsonreference v0.20.1 // indirect
	github.com/go-openapi/swag v0.22.3 // indirect
	github.com/gobwas/glob v0.2.3 // indirect
	github.com/gogo/protobuf v1.3.2 // indirect
	github.com/golang/groupcache v0.0.0-20210331224755-41bb18bfe9da // indirect
	github.com/golang/protobuf v1.5.3 // indirect
	github.com/google/btree v1.0.1 // indirect
	github.com/google/gnostic v0.5.7-v3refs // indirect
	github.com/google/go-cmp v0.5.9 // indirect
	github.com/google/gofuzz v1.2.0 // indirect
	github.com/gosuri/uilive v0.0.4 // indirect
	github.com/gregjones/httpcache v0.0.0-20180305231024-9cad4c3443a7 // indirect
	github.com/hooklift/assert v0.1.0 // indirect
	github.com/imdario/mergo v0.3.13 // indirect
	github.com/inconshreveable/mousetrap v1.1.0 // indirect
	github.com/josharian/intern v1.0.0 // indirect
	github.com/kennygrant/sanitize v1.2.4 // indirect
	github.com/klauspost/compress v1.17.3 // indirect
	github.com/liggitt/tabwriter v0.0.0-20181228230101-89fcab3d43de // indirect
	github.com/mailru/easyjson v0.7.7 // indirect
	github.com/mattn/go-isatty v0.0.14 // indirect
	github.com/mattn/go-shellwords v1.0.12 // indirect
	github.com/mitchellh/go-homedir v1.1.0 // indirect
	github.com/moby/spdystream v0.2.0 // indirect
	github.com/modern-go/concurrent v0.0.0-20180306012644-bacd9c7ef1dd // indirect
	github.com/modern-go/reflect2 v1.0.2 // indirect
	github.com/monochromegane/go-gitignore v0.0.0-20200626010858-205db1a8cc00 // indirect
	github.com/morikuni/aec v1.0.0 // indirect
	github.com/munnerz/goautoneg v0.0.0-20191010083416-a7dc8b61c822 // indirect
	github.com/opencontainers/go-digest v1.0.0 // indirect
	github.com/opencontainers/runc v1.1.10 // indirect
	github.com/peterbourgon/diskv v2.0.1+incompatible // indirect
	github.com/pmezard/go-difflib v1.0.0 // indirect
	github.com/rivo/uniseg v0.2.0 // indirect
	github.com/russross/blackfriday/v2 v2.1.0 // indirect
	github.com/saintfish/chardet v0.0.0-20230101081208-5e3ef4b5456d // indirect
	github.com/slimtoolkit/uilive v0.0.2 // indirect
	github.com/spf13/cobra v1.7.0 // indirect
	github.com/spf13/pflag v1.0.5 // indirect
	github.com/temoto/robotstxt v1.1.2 // indirect
	github.com/ulyssessouza/godotenv v1.3.1-0.20210806120901-e417b721114e // indirect
	github.com/vbatts/tar-split v0.11.3 // indirect
	github.com/xlab/treeprint v1.1.0 // indirect
	go.starlark.net v0.0.0-20200306205701-8dd3e2ee1dd5 // indirect
	golang.org/x/mod v0.14.0 // indirect
	golang.org/x/oauth2 v0.10.0 // indirect
	golang.org/x/sync v0.5.0 // indirect
	golang.org/x/term v0.15.0 // indirect
	golang.org/x/text v0.14.0 // indirect
	golang.org/x/time v0.0.0-20220210224613-90d013bbcef8 // indirect
	golang.org/x/tools v0.15.0 // indirect
	google.golang.org/appengine v1.6.7 // indirect
	google.golang.org/protobuf v1.31.0 // indirect
	gopkg.in/inf.v0 v0.9.1 // indirect
	gopkg.in/yaml.v2 v2.4.0 // indirect
	gopkg.in/yaml.v3 v3.0.1 // indirect
	sigs.k8s.io/json v0.0.0-20221116044647-bc3834ca7abd // indirect
	sigs.k8s.io/kustomize/api v0.13.2 // indirect
	sigs.k8s.io/kustomize/kyaml v0.14.1 // indirect
	sigs.k8s.io/structured-merge-diff/v4 v4.2.3 // indirect
	sigs.k8s.io/yaml v1.3.0 // indirect
)

require (
	github.com/PuerkitoBio/goquery v1.8.1 // indirect
	github.com/andybalholm/cascadia v1.3.2 // indirect
	github.com/antchfx/htmlquery v1.3.0 // indirect
	github.com/antchfx/xmlquery v1.3.17 // indirect
	github.com/antchfx/xpath v1.2.4 // indirect
	github.com/containerd/containerd v1.7.9 // indirect
	github.com/davecgh/go-spew v1.1.1 // indirect
	github.com/dsnet/compress v0.0.1 // indirect
	github.com/google/uuid v1.3.0
	github.com/json-iterator/go v1.1.12 // indirect
	github.com/klauspost/pgzip v1.2.4 // indirect
	github.com/mattn/go-colorable v0.1.12 // indirect
	github.com/mattn/go-runewidth v0.0.13 // indirect
	github.com/mattn/go-tty v0.0.3 // indirect
	github.com/mitchellh/mapstructure v1.4.3 // indirect
	github.com/moby/patternmatcher v0.6.0 // indirect
	github.com/moby/sys/sequential v0.5.0 // indirect
	github.com/pkg/term v0.0.0-20200520122047-c3ffed290a03 // indirect
	github.com/stretchr/testify v1.8.4
	github.com/ulikunitz/xz v0.5.7 // indirect
	k8s.io/klog/v2 v2.90.1 // indirect
	k8s.io/kube-openapi v0.0.0-20230501164219-8b0f38b5fd1f // indirect
	k8s.io/utils v0.0.0-20230220204549-a5ecb0141aa5 // indirect
)

replace github.com/compose-spec/compose-go => ./pkg/third_party/compose-go
