module s3scanner

go 1.18

require (
	github.com/aws/aws-sdk-go-v2 v1.18.1
	github.com/aws/aws-sdk-go-v2/config v1.18.27
	github.com/aws/aws-sdk-go-v2/feature/s3/manager v1.11.70
	github.com/aws/aws-sdk-go-v2/service/s3 v1.35.0
	github.com/dustin/go-humanize v1.0.1
	github.com/sirupsen/logrus v1.9.3
	github.com/spf13/viper v1.16.0
	github.com/streadway/amqp v1.1.0
	github.com/stretchr/testify v1.8.3
	golang.org/x/sync v0.1.0
	gorm.io/driver/postgres v1.5.2
	gorm.io/gorm v1.25.1
)

require (
	github.com/aws/aws-sdk-go-v2/aws/protocol/eventstream v1.4.10 // indirect
	github.com/aws/aws-sdk-go-v2/credentials v1.13.26 // indirect
	github.com/aws/aws-sdk-go-v2/feature/ec2/imds v1.13.4 // indirect
	github.com/aws/aws-sdk-go-v2/internal/configsources v1.1.34 // indirect
	github.com/aws/aws-sdk-go-v2/internal/endpoints/v2 v2.4.28 // indirect
	github.com/aws/aws-sdk-go-v2/internal/ini v1.3.35 // indirect
	github.com/aws/aws-sdk-go-v2/internal/v4a v1.0.26 // indirect
	github.com/aws/aws-sdk-go-v2/service/internal/accept-encoding v1.9.11 // indirect
	github.com/aws/aws-sdk-go-v2/service/internal/checksum v1.1.29 // indirect
	github.com/aws/aws-sdk-go-v2/service/internal/presigned-url v1.9.28 // indirect
	github.com/aws/aws-sdk-go-v2/service/internal/s3shared v1.14.3 // indirect
	github.com/aws/aws-sdk-go-v2/service/sso v1.12.12 // indirect
	github.com/aws/aws-sdk-go-v2/service/ssooidc v1.14.12 // indirect
	github.com/aws/aws-sdk-go-v2/service/sts v1.19.2 // indirect
	github.com/aws/smithy-go v1.13.5 // indirect
	github.com/davecgh/go-spew v1.1.1 // indirect
	github.com/fsnotify/fsnotify v1.6.0 // indirect
	github.com/hashicorp/hcl v1.0.0 // indirect
	github.com/jackc/pgpassfile v1.0.0 // indirect
	github.com/jackc/pgservicefile v0.0.0-20221227161230-091c0ba34f0a // indirect
	github.com/jackc/pgx/v5 v5.4.1 // indirect
	github.com/jinzhu/inflection v1.0.0 // indirect
	github.com/jinzhu/now v1.1.5 // indirect
	github.com/jmespath/go-jmespath v0.4.0 // indirect
	github.com/magiconair/properties v1.8.7 // indirect
	github.com/mitchellh/mapstructure v1.5.0 // indirect
	github.com/pelletier/go-toml/v2 v2.0.8 // indirect
	github.com/pmezard/go-difflib v1.0.0 // indirect
	github.com/spf13/afero v1.9.5 // indirect
	github.com/spf13/cast v1.5.1 // indirect
	github.com/spf13/jwalterweatherman v1.1.0 // indirect
	github.com/spf13/pflag v1.0.5 // indirect
	github.com/subosito/gotenv v1.4.2 // indirect
	golang.org/x/crypto v0.10.0 // indirect
	golang.org/x/sys v0.9.0 // indirect
	golang.org/x/text v0.10.0 // indirect
	gopkg.in/ini.v1 v1.67.0 // indirect
	gopkg.in/yaml.v2 v2.4.0 // indirect
	gopkg.in/yaml.v3 v3.0.1 // indirect
)
