module github.com/mongodb/mongo-tools

go 1.20

require (
	github.com/3rf/mongo-lint v0.0.0-20140604191638-3550fdcf1f43
	github.com/aws/aws-sdk-go v1.44.317
	github.com/craiggwilson/goke v0.0.0-20220110201909-adb8bfb05d58
	github.com/google/go-cmp v0.5.9
	github.com/gopherjs/gopherjs v1.17.2 // indirect
	github.com/jessevdk/go-flags v1.5.0
	github.com/mattn/go-colorable v0.1.13 // indirect
	github.com/mattn/go-runewidth v0.0.14 // indirect
	github.com/mgutz/ansi v0.0.0-20200706080929-d51e80ef957d // indirect
	github.com/mitchellh/go-wordwrap v1.0.1
	github.com/nsf/termbox-go v1.1.1
	github.com/pkg/errors v0.9.1
	github.com/smartystreets/goconvey v1.6.4
	github.com/stretchr/testify v1.8.4
	github.com/youmark/pkcs8 v0.0.0-20201027041543-1326539a0a0a
	go.mongodb.org/mongo-driver v1.10.3
	golang.org/x/crypto v0.14.0
	golang.org/x/sys v0.13.0 // indirect
	gopkg.in/tomb.v2 v2.0.0-20161208151619-d5d1b5820637
	gopkg.in/yaml.v2 v2.4.0
	gopkg.in/yaml.v3 v3.0.1
)

require (
	github.com/urfave/cli/v2 v2.25.7
	golang.org/x/exp v0.0.0-20230321023759-10a507213a29
	golang.org/x/mod v0.12.0
)

require (
	github.com/cpuguy83/go-md2man/v2 v2.0.2 // indirect
	github.com/davecgh/go-spew v1.1.1 // indirect
	github.com/golang/snappy v0.0.4 // indirect
	github.com/jmespath/go-jmespath v0.4.0 // indirect
	github.com/jtolds/gls v4.20.0+incompatible // indirect
	github.com/klauspost/compress v1.13.6 // indirect
	github.com/mattn/go-isatty v0.0.16 // indirect
	github.com/montanaflynn/stats v0.6.6 // indirect
	github.com/pmezard/go-difflib v1.0.0 // indirect
	github.com/rivo/uniseg v0.2.0 // indirect
	github.com/russross/blackfriday/v2 v2.1.0 // indirect
	github.com/smartystreets/assertions v0.0.0-20180927180507-b2de0cb4f26d // indirect
	github.com/xdg-go/pbkdf2 v1.0.0 // indirect
	github.com/xdg-go/scram v1.1.1 // indirect
	github.com/xdg-go/stringprep v1.0.3 // indirect
	github.com/xrash/smetrics v0.0.0-20201216005158-039620a65673 // indirect
	golang.org/x/net v0.17.0 // indirect
	golang.org/x/sync v0.1.0 // indirect
	golang.org/x/term v0.13.0 // indirect
	golang.org/x/text v0.13.0 // indirect
)
