<?xml version="1.0" encoding="utf-8"?>
<!-- Generator: Adobe Illustrator 18.1.0, SVG Export Plug-In . SVG Version: 6.00 Build 0)  -->
<!DOCTYPE svg PUBLIC "-//W3C//DTD SVG 1.1//EN" "http://www.w3.org/Graphics/SVG/1.1/DTD/svg11.dtd">
<svg version="1.1" id="Layer_1" xmlns="http://www.w3.org/2000/svg" xmlns:xlink="http://www.w3.org/1999/xlink" x="0px" y="0px"
	 viewBox="0 0 88 88" enable-background="new 0 0 88 88" xml:space="preserve">
<g>
	<circle fill="#696969" cx="44" cy="14.2" r="12.2"/>
	<g>
		<circle fill="#696969" cx="44" cy="76.3" r="9.8"/>
		<circle fill="#696969" cx="76.3" cy="76.3" r="9.8"/>
		<circle fill="#696969" cx="11.7" cy="76.3" r="9.8"/>
	</g>
	<line fill="none" stroke="#696969" stroke-width="3" stroke-miterlimit="10" x1="44.5" y1="26.4" x2="44.5" y2="66.5"/>
	<path fill="none" stroke="#696969" stroke-width="3" stroke-miterlimit="10" d="M11.7,66.5c0,0-2.9-17,16.1-24.9
		C42,35.7,44,26.4,44,26.4"/>
	<path fill="none" stroke="#696969" stroke-width="3" stroke-miterlimit="10" d="M76.8,66.5c0,0,2.9-17-16.1-24.9
		c-14.2-5.9-16.1-15.2-16.1-15.2"/>
</g>
</svg>
