module sigs.k8s.io/kustomize/plugin/someteam.example.com/v1/calvinduplicator

go 1.22.7

require (
	sigs.k8s.io/kustomize/api v0.19.0
	sigs.k8s.io/yaml v1.4.0
)

require (
	github.com/blang/semver/v4 v4.0.0 // indirect
	github.com/davecgh/go-spew v1.1.1 // indirect
	github.com/go-errors/errors v1.4.2 // indirect
	github.com/go-openapi/jsonpointer v0.21.0 // indirect
	github.com/go-openapi/jsonreference v0.20.2 // indirect
	github.com/go-openapi/swag v0.23.0 // indirect
	github.com/google/gnostic-models v0.6.9 // indirect
	github.com/google/shlex v0.0.0-20191202100458-e7afc7fbc510 // indirect
	github.com/josharian/intern v1.0.0 // indirect
	github.com/mailru/easyjson v0.7.7 // indirect
	github.com/monochromegane/go-gitignore v0.0.0-20200626010858-205db1a8cc00 // indirect
	github.com/pkg/errors v0.9.1 // indirect
	github.com/pmezard/go-difflib v1.0.0 // indirect
	github.com/stretchr/testify v1.9.0 // indirect
	github.com/xlab/treeprint v1.2.0 // indirect
	golang.org/x/sys v0.28.0 // indirect
	google.golang.org/protobuf v1.35.1 // indirect
	gopkg.in/evanphx/json-patch.v4 v4.12.0 // indirect
	gopkg.in/yaml.v3 v3.0.1 // indirect
	k8s.io/kube-openapi v0.0.0-20241212222426-2c72e554b1e7 // indirect
	sigs.k8s.io/kustomize/kyaml v0.19.0 // indirect
)
