<?xml version="1.0" encoding="UTF-8" standalone="no"?>
<svg
   width="3480"
   height="2160"
   version="1.1"
   viewBox="0 0 920.75 571.5"
   id="svg40"
   sodipodi:docname="lights.svg"
   inkscape:version="1.4 (e7c3feb100, 2024-10-09)"
   xml:space="preserve"
   inkscape:export-filename="grub-16x9.png"
   inkscape:export-xdpi="96"
   inkscape:export-ydpi="96"
   xmlns:inkscape="http://www.inkscape.org/namespaces/inkscape"
   xmlns:sodipodi="http://sodipodi.sourceforge.net/DTD/sodipodi-0.dtd"
   xmlns:xlink="http://www.w3.org/1999/xlink"
   xmlns="http://www.w3.org/2000/svg"
   xmlns:svg="http://www.w3.org/2000/svg"><sodipodi:namedview
     id="namedview23"
     pagecolor="#ffffff"
     bordercolor="#111111"
     borderopacity="1"
     inkscape:pageshadow="0"
     inkscape:pageopacity="0"
     inkscape:pagecheckerboard="1"
     showgrid="false"
     inkscape:zoom="0.25436203"
     inkscape:cx="2720.5319"
     inkscape:cy="1108.656"
     inkscape:window-width="3459"
     inkscape:window-height="1723"
     inkscape:window-x="1410"
     inkscape:window-y="179"
     inkscape:window-maximized="0"
     inkscape:current-layer="a"
     borderlayer="true"
     inkscape:snap-global="false"
     inkscape:showpageshadow="0"
     inkscape:deskcolor="#d1d1d1" /><defs
     id="defs19"><radialGradient
       id="radialGradient17"
       cx="630.90002"
       cy="-320.51999"
       r="508"
       gradientTransform="matrix(-0.85715363,0,2.6969816e-5,-0.85618491,969.34173,-89.322802)"
       gradientUnits="userSpaceOnUse"
       fx="630.90002"
       fy="-320.51999"><stop
         stop-color="#23bac2"
         offset="0"
         id="stop15"
         style="stop-color:#0f2751;stop-opacity:1" /><stop
         stop-color="#23bac2"
         offset="0.23404065"
         id="stop18"
         style="stop-color:#1b3f7c;stop-opacity:1" /><stop
         stop-color="#3b6ab9"
         offset="1"
         id="stop17"
         style="stop-color:#23bac2;stop-opacity:0;" /></radialGradient><radialGradient
       id="radialGradient13"
       cx="630.90002"
       cy="-320.51999"
       r="508"
       gradientTransform="matrix(-0.85715363,0,2.6969816e-5,-0.85618491,969.34173,-89.322802)"
       gradientUnits="userSpaceOnUse"
       fx="630.90002"
       fy="-320.51999"><stop
         stop-color="#23bac2"
         offset="0"
         id="stop12"
         style="stop-color:#b8174c;stop-opacity:1" /><stop
         stop-color="#3b6ab9"
         offset="1"
         id="stop13"
         style="stop-color:#b8174c;stop-opacity:0.29005623" /></radialGradient><radialGradient
       id="radialGradient10"
       cx="630.90002"
       cy="-320.51999"
       r="508"
       gradientTransform="matrix(-0.85715363,0,2.6969816e-5,-0.85618491,969.34173,-89.322802)"
       gradientUnits="userSpaceOnUse"
       fx="630.90002"
       fy="-320.51999"><stop
         stop-color="#23bac2"
         offset="0"
         id="stop9"
         style="stop-color:#23bac2;stop-opacity:1" /><stop
         stop-color="#3b6ab9"
         offset="1"
         id="stop10"
         style="stop-color:#23bac2;stop-opacity:0" /></radialGradient><filter
       id="c"
       x="-0.015693121"
       y="-0.021101909"
       width="1.0313863"
       height="1.0422038"
       style="color-interpolation-filters:sRGB"><feGaussianBlur
         stdDeviation="8.0153465"
         id="feGaussianBlur2" /></filter><filter
       id="d"
       style="color-interpolation-filters:sRGB"
       x="-0.0055470811"
       y="-0.010548976"
       width="1.0110942"
       height="1.0210979"><feGaussianBlur
         stdDeviation="3"
         id="feGaussianBlur5" /></filter><clipPath
       id="e"><rect
         x="119.84"
         y="66.981003"
         width="268.32001"
         height="151.78999"
         rx="2.6458001"
         ry="2.6458001"
         style="opacity:0.2;paint-order:normal"
         id="rect8" /></clipPath><filter
       id="b"
       x="-0.037576921"
       y="-0.066424929"
       width="1.0751538"
       height="1.1328499"
       style="color-interpolation-filters:sRGB"><feGaussianBlur
         stdDeviation="4.2011"
         id="feGaussianBlur11" /></filter><radialGradient
       id="f"
       cx="730.25531"
       cy="-257.35535"
       r="508"
       gradientTransform="matrix(-0.47781,0,1.5034e-5,-0.47727,730.01,32.127)"
       gradientUnits="userSpaceOnUse"
       fx="730.25531"
       fy="-257.35535"><stop
         stop-color="#23bac2"
         offset="0"
         id="stop14" /><stop
         stop-color="#3b6ab9"
         offset="1"
         id="stop16" /></radialGradient><radialGradient
       id="a-3-3"
       cx="509.19199"
       cy="277.0477"
       r="508"
       gradientTransform="matrix(1.4993723,0,0,1.2986325,-1270.0953,-84.837182)"
       gradientUnits="userSpaceOnUse"
       fx="509.19199"
       fy="277.0477"><stop
         stop-color="#316fd8"
         offset="0"
         id="stop2-6-6"
         style="stop-color:#2777ff;stop-opacity:1" /><stop
         stop-color="#23bac2"
         offset="1"
         id="stop4-7-7"
         style="stop-color:#622e78;stop-opacity:1" /></radialGradient><linearGradient
       id="a-3"
       x1="662.87"
       x2="662.87"
       y1="6.4966998"
       y2="6.4857001"
       gradientTransform="matrix(0.83977,0,0,0.83977,81.4,276.3)"
       gradientUnits="userSpaceOnUse"><stop
         stop-color="#153873"
         offset="0"
         id="stop3752"
         style="stop-color:#000000;stop-opacity:1;" /><stop
         stop-color="#367bf0"
         offset="1"
         id="stop3754"
         style="stop-color:#ffffff;stop-opacity:1;" /></linearGradient><filter
       id="m"
       x="-0.27148741"
       y="-0.19841275"
       width="1.5429748"
       height="1.3968256"
       style="color-interpolation-filters:sRGB"><feGaussianBlur
         stdDeviation="0.98694082"
         id="feGaussianBlur4689" /></filter><radialGradient
       id="q"
       cx="593.09998"
       cy="261.72"
       r="23.186001"
       gradientTransform="matrix(1.2757,0,0,1.2757,-324.78889,-258.97225)"
       gradientUnits="userSpaceOnUse"><stop
         stop-color="#fff"
         stop-opacity=".4"
         style="stop-color:#f8de68;stop-opacity:1"
         offset="0"
         id="stop4673" /><stop
         stop-color="#fff"
         stop-opacity="0"
         style="stop-color:#678bc8;stop-opacity:0"
         offset="1"
         id="stop4675" /></radialGradient><filter
       id="p"
       x="-0.041045688"
       y="-0.026859323"
       width="1.0820915"
       height="1.0537186"
       color-interpolation-filters="sRGB"><feGaussianBlur
         stdDeviation="1.5070609"
         id="feGaussianBlur4678" /></filter><filter
       id="o"
       x="-0.083748423"
       y="-0.096701331"
       width="1.1674968"
       height="1.1934026"
       color-interpolation-filters="sRGB"><feGaussianBlur
         stdDeviation="2.1777382"
         id="feGaussianBlur4670" /></filter><filter
       id="l"
       x="-0.73734099"
       y="-0.53887522"
       width="2.4746821"
       height="2.0777504"
       style="color-interpolation-filters:sRGB"><feGaussianBlur
         stdDeviation="2.6804628"
         id="feGaussianBlur4692" /></filter><filter
       style="color-interpolation-filters:sRGB"
       inkscape:label="Drop Shadow"
       id="filter7676"
       x="-0.035778172"
       y="-0.063245274"
       width="1.0715563"
       height="1.1264906"><feFlood
         flood-opacity="1"
         flood-color="rgb(255,255,255)"
         result="flood"
         id="feFlood7666" /><feComposite
         in="flood"
         in2="SourceGraphic"
         operator="out"
         result="composite1"
         id="feComposite7668" /><feGaussianBlur
         in="composite1"
         stdDeviation="3.9999999"
         result="blur"
         id="feGaussianBlur7670" /><feOffset
         dx="0"
         dy="0"
         result="offset"
         id="feOffset7672" /><feComposite
         in="offset"
         in2="SourceGraphic"
         operator="atop"
         result="composite2"
         id="feComposite7674" /></filter><filter
       style="color-interpolation-filters:sRGB"
       inkscape:label="Drop Shadow"
       id="filter8072"
       x="-0.014541548"
       y="-0.023630595"
       width="1.0290831"
       height="1.043187"><feFlood
         flood-opacity="1"
         flood-color="rgb(0,0,0)"
         result="flood"
         id="feFlood8062" /><feComposite
         in="flood"
         in2="SourceGraphic"
         operator="out"
         result="composite1"
         id="feComposite8064" /><feGaussianBlur
         in="composite1"
         stdDeviation="4"
         result="blur"
         id="feGaussianBlur8066" /><feOffset
         dx="0"
         dy="-2"
         result="offset"
         id="feOffset8068" /><feComposite
         in="offset"
         in2="SourceGraphic"
         operator="atop"
         result="composite2"
         id="feComposite8070" /></filter><filter
       id="filter4"
       x="-1.2909942e-05"
       y="-2.2820976e-05"
       width="1.0000257"
       height="1.0000457"
       style="color-interpolation-filters:sRGB"><feGaussianBlur
         stdDeviation="0.0014433316"
         id="feGaussianBlur4" /></filter><filter
       style="color-interpolation-filters:sRGB"
       inkscape:label="Drop Shadow"
       id="filter7676-9"
       x="-0.035778172"
       y="-0.063245274"
       width="1.0715563"
       height="1.1264906"><feFlood
         flood-opacity="1"
         flood-color="rgb(255,255,255)"
         result="flood"
         id="feFlood7666-9" /><feComposite
         in="flood"
         in2="SourceGraphic"
         operator="out"
         result="composite1"
         id="feComposite7668-3" /><feGaussianBlur
         in="composite1"
         stdDeviation="3.9999999"
         result="blur"
         id="feGaussianBlur7670-8" /><feOffset
         dx="0"
         dy="0"
         result="offset"
         id="feOffset7672-3" /><feComposite
         in="offset"
         in2="SourceGraphic"
         operator="atop"
         result="composite2"
         id="feComposite7674-2" /></filter><filter
       style="color-interpolation-filters:sRGB"
       inkscape:label="Drop Shadow"
       id="filter7676-95"
       x="-0.035778172"
       y="-0.063245274"
       width="1.0715563"
       height="1.1264906"><feFlood
         flood-opacity="1"
         flood-color="rgb(255,255,255)"
         result="flood"
         id="feFlood7666-4" /><feComposite
         in="flood"
         in2="SourceGraphic"
         operator="out"
         result="composite1"
         id="feComposite7668-39" /><feGaussianBlur
         in="composite1"
         stdDeviation="3.9999999"
         result="blur"
         id="feGaussianBlur7670-4" /><feOffset
         dx="0"
         dy="0"
         result="offset"
         id="feOffset7672-9" /><feComposite
         in="offset"
         in2="SourceGraphic"
         operator="atop"
         result="composite2"
         id="feComposite7674-5" /></filter><filter
       id="a-36"
       color-interpolation-filters="sRGB"
       height="1.319353"
       width="1.1624331"
       x="-0.081216611"
       y="-0.15967652"><feGaussianBlur
         stdDeviation="12.664849"
         id="feGaussianBlur1" /></filter><filter
       id="a-36-6"
       color-interpolation-filters="sRGB"
       height="1.1419348"
       width="1.0721925"
       x="-0.036096271"
       y="-0.070967339"><feGaussianBlur
         stdDeviation="5.6288217"
         id="feGaussianBlur1-7" /></filter><filter
       id="c-3"
       x="-0.015693121"
       y="-0.021101909"
       width="1.0313863"
       height="1.0422038"
       style="color-interpolation-filters:sRGB"><feGaussianBlur
         stdDeviation="8.0153465"
         id="feGaussianBlur1-6" /></filter><radialGradient
       id="a-7"
       cx="455.5"
       cy="-321.35001"
       r="508"
       gradientTransform="matrix(0.3527601,0.00392715,0,0.35217914,288.03823,357.30768)"
       gradientUnits="userSpaceOnUse"><stop
         stop-color="#23bac2"
         offset="0"
         id="stop3" /><stop
         stop-color="#3b6ab9"
         offset="1"
         id="stop4" /></radialGradient><filter
       id="c-35"
       x="-0.015693121"
       y="-0.021101909"
       width="1.0313863"
       height="1.0422038"
       style="color-interpolation-filters:sRGB"><feGaussianBlur
         stdDeviation="8.0153465"
         id="feGaussianBlur1-62" /></filter><radialGradient
       id="f-9"
       cx="630.90002"
       cy="-320.51999"
       r="508"
       gradientTransform="matrix(-0.85715363,0,2.6969816e-5,-0.85618491,969.34173,-89.322802)"
       gradientUnits="userSpaceOnUse"
       fx="630.90002"
       fy="-320.51999"><stop
         stop-color="#23bac2"
         offset="0"
         id="stop3-1"
         style="stop-color:#367bf0;stop-opacity:1" /><stop
         stop-color="#3b6ab9"
         offset="1"
         id="stop4-2"
         style="stop-color:#0f2751;stop-opacity:1" /></radialGradient><radialGradient
       id="f-9-1"
       cx="630.90002"
       cy="-320.51999"
       r="508"
       gradientTransform="matrix(-0.85715363,0,2.6969816e-5,-0.85618491,969.34173,-89.322802)"
       gradientUnits="userSpaceOnUse"
       fx="630.90002"
       fy="-320.51999"><stop
         stop-color="#23bac2"
         offset="0"
         id="stop3-1-9"
         style="stop-color:#367bf0;stop-opacity:1" /><stop
         stop-color="#3b6ab9"
         offset="1"
         id="stop4-2-4"
         style="stop-color:#0f2751;stop-opacity:1" /></radialGradient><clipPath
       clipPathUnits="userSpaceOnUse"
       id="clipPath16"><rect
         style="opacity:0.264484;fill:#65cfd4;fill-rule:evenodd;stroke-width:10.5833;stroke-linecap:round;stroke-linejoin:round;stroke-miterlimit:16.8;paint-order:stroke fill markers"
         id="rect16"
         width="508"
         height="285.75"
         x="-3.5527137e-15"
         y="1.5987212e-14" /></clipPath><radialGradient
       id="f-9-3"
       cx="630.90002"
       cy="-320.51999"
       r="508"
       gradientTransform="matrix(-0.85715363,0,2.6969816e-5,-0.85618491,969.34173,-89.322802)"
       gradientUnits="userSpaceOnUse"
       fx="630.90002"
       fy="-320.51999"><stop
         stop-color="#23bac2"
         offset="0"
         id="stop3-1-6"
         style="stop-color:#367bf0;stop-opacity:1" /><stop
         stop-color="#3b6ab9"
         offset="1"
         id="stop4-2-7"
         style="stop-color:#0f2751;stop-opacity:1" /></radialGradient><radialGradient
       id="radialGradient10-3"
       cx="630.90002"
       cy="-320.51999"
       r="508"
       gradientTransform="matrix(-0.85715363,0,2.6969816e-5,-0.85618491,969.34173,-89.322802)"
       gradientUnits="userSpaceOnUse"
       fx="630.90002"
       fy="-320.51999"><stop
         stop-color="#23bac2"
         offset="0"
         id="stop9-5"
         style="stop-color:#23bac2;stop-opacity:1" /><stop
         stop-color="#3b6ab9"
         offset="1"
         id="stop10-6"
         style="stop-color:#23bac2;stop-opacity:0" /></radialGradient><radialGradient
       id="radialGradient17-9"
       cx="630.90002"
       cy="-320.51999"
       r="508"
       gradientTransform="matrix(-0.85715363,0,2.6969816e-5,-0.85618491,969.34173,-89.322802)"
       gradientUnits="userSpaceOnUse"
       fx="630.90002"
       fy="-320.51999"><stop
         stop-color="#23bac2"
         offset="0"
         id="stop15-1"
         style="stop-color:#0f2751;stop-opacity:1" /><stop
         stop-color="#23bac2"
         offset="0.23404065"
         id="stop18-2"
         style="stop-color:#1b3f7c;stop-opacity:1" /><stop
         stop-color="#3b6ab9"
         offset="1"
         id="stop17-7"
         style="stop-color:#23bac2;stop-opacity:0;" /></radialGradient><radialGradient
       id="radialGradient10-8"
       cx="630.90002"
       cy="-320.51999"
       r="508"
       gradientTransform="matrix(-0.85715363,0,2.6969816e-5,-0.85618491,969.34173,-89.322802)"
       gradientUnits="userSpaceOnUse"
       fx="630.90002"
       fy="-320.51999"><stop
         stop-color="#23bac2"
         offset="0"
         id="stop9-4"
         style="stop-color:#23bac2;stop-opacity:1" /><stop
         stop-color="#3b6ab9"
         offset="1"
         id="stop10-0-5"
         style="stop-color:#23bac2;stop-opacity:0" /></radialGradient><radialGradient
       id="radialGradient17-3"
       cx="630.90002"
       cy="-320.51999"
       r="508"
       gradientTransform="matrix(-0.85715363,0,2.6969816e-5,-0.85618491,969.34173,-89.322802)"
       gradientUnits="userSpaceOnUse"
       fx="630.90002"
       fy="-320.51999"><stop
         stop-color="#23bac2"
         offset="0"
         id="stop15-6"
         style="stop-color:#0f2751;stop-opacity:1" /><stop
         stop-color="#23bac2"
         offset="0.23404065"
         id="stop18-1"
         style="stop-color:#1b3f7c;stop-opacity:1" /><stop
         stop-color="#3b6ab9"
         offset="1"
         id="stop17-0"
         style="stop-color:#23bac2;stop-opacity:0;" /></radialGradient><radialGradient
       id="f-9-1-6"
       cx="630.90002"
       cy="-320.51999"
       r="508"
       gradientTransform="matrix(-1.5562682,0,4.896703e-5,-1.7123699,1758.3729,-178.6456)"
       gradientUnits="userSpaceOnUse"
       fx="630.90002"
       fy="-320.51999"><stop
         stop-color="#23bac2"
         offset="0"
         id="stop3-1-9-7"
         style="stop-color:#367bf0;stop-opacity:1" /><stop
         stop-color="#3b6ab9"
         offset="1"
         id="stop4-2-4-5"
         style="stop-color:#0f2751;stop-opacity:1" /></radialGradient><radialGradient
       id="f-9-3-6"
       cx="630.90002"
       cy="-320.51999"
       r="508"
       gradientTransform="matrix(-0.86735513,0,2.72908e-5,-0.85618491,978.00743,-89.322802)"
       gradientUnits="userSpaceOnUse"
       fx="630.90002"
       fy="-320.51999"><stop
         stop-color="#23bac2"
         offset="0"
         id="stop3-1-6-2"
         style="stop-color:#367bf0;stop-opacity:1" /><stop
         stop-color="#3b6ab9"
         offset="1"
         id="stop4-2-7-9"
         style="stop-color:#0f2751;stop-opacity:1" /></radialGradient><radialGradient
       id="radialGradient10-3-1"
       cx="630.90002"
       cy="-320.51999"
       r="508"
       gradientTransform="matrix(-0.85715363,0,2.6969816e-5,-0.85618491,969.34173,-89.322802)"
       gradientUnits="userSpaceOnUse"
       fx="630.90002"
       fy="-320.51999"><stop
         stop-color="#23bac2"
         offset="0"
         id="stop9-5-2"
         style="stop-color:#23bac2;stop-opacity:1" /><stop
         stop-color="#3b6ab9"
         offset="1"
         id="stop10-6-7"
         style="stop-color:#23bac2;stop-opacity:0" /></radialGradient><radialGradient
       id="radialGradient17-9-0"
       cx="630.90002"
       cy="-320.51999"
       r="508"
       gradientTransform="matrix(-0.85715363,0,2.6969816e-5,-0.85618491,969.34173,-89.322802)"
       gradientUnits="userSpaceOnUse"
       fx="630.90002"
       fy="-320.51999"><stop
         stop-color="#23bac2"
         offset="0"
         id="stop15-1-9"
         style="stop-color:#0f2751;stop-opacity:1" /><stop
         stop-color="#23bac2"
         offset="0.23404065"
         id="stop18-2-3"
         style="stop-color:#1b3f7c;stop-opacity:1" /><stop
         stop-color="#3b6ab9"
         offset="1"
         id="stop17-7-6"
         style="stop-color:#23bac2;stop-opacity:0;" /></radialGradient><radialGradient
       inkscape:collect="always"
       xlink:href="#radialGradient10-8-0"
       id="radialGradient11-7"
       cx="508.00452"
       cy="396.8493"
       fx="508.00452"
       fy="396.8493"
       r="254"
       gradientTransform="matrix(1.8156235,0,0,1.125,-1.5867023,125.01563)"
       gradientUnits="userSpaceOnUse" /><radialGradient
       id="radialGradient10-8-0"
       cx="630.90002"
       cy="-320.51999"
       r="508"
       gradientTransform="matrix(-0.85715363,0,2.6969816e-5,-0.85618491,969.34173,-89.322802)"
       gradientUnits="userSpaceOnUse"
       fx="630.90002"
       fy="-320.51999"><stop
         stop-color="#23bac2"
         offset="0"
         id="stop9-4-6"
         style="stop-color:#23bac2;stop-opacity:1" /><stop
         stop-color="#3b6ab9"
         offset="1"
         id="stop10-0-5-2"
         style="stop-color:#23bac2;stop-opacity:0" /></radialGradient><radialGradient
       inkscape:collect="always"
       xlink:href="#radialGradient17-3-6"
       id="radialGradient14-0"
       gradientUnits="userSpaceOnUse"
       gradientTransform="matrix(2.5660656,2.3855043,-1.4040293,1.8326188,-23.806256,-44.398035)"
       cx="86.017075"
       cy="200.82939"
       fx="86.017075"
       fy="200.82939"
       r="254" /><radialGradient
       id="radialGradient17-3-6"
       cx="630.90002"
       cy="-320.51999"
       r="508"
       gradientTransform="matrix(-0.85715363,0,2.6969816e-5,-0.85618491,969.34173,-89.322802)"
       gradientUnits="userSpaceOnUse"
       fx="630.90002"
       fy="-320.51999"><stop
         stop-color="#23bac2"
         offset="0"
         id="stop15-6-1"
         style="stop-color:#0f2751;stop-opacity:1" /><stop
         stop-color="#23bac2"
         offset="0.23404065"
         id="stop18-1-8"
         style="stop-color:#1b3f7c;stop-opacity:1" /><stop
         stop-color="#3b6ab9"
         offset="1"
         id="stop17-0-7"
         style="stop-color:#23bac2;stop-opacity:0;" /></radialGradient><clipPath
       clipPathUnits="userSpaceOnUse"
       id="clipPath1"><rect
         style="opacity:0.264484;fill:#65cfd4;fill-rule:evenodd;stroke-width:11.0207;stroke-linecap:round;stroke-linejoin:round;stroke-miterlimit:16.8;paint-order:stroke fill markers"
         id="rect2"
         width="441.25766"
         height="356.72614"
         x="-2.4644871"
         y="1.9984014e-14"
         transform="matrix(-0.67325215,-0.73941297,0.72256139,-0.69130676,0,0)" /></clipPath><clipPath
       clipPathUnits="userSpaceOnUse"
       id="clipPath2"><rect
         style="opacity:0.264484;fill:#65cfd4;fill-rule:evenodd;stroke-width:11.0207;stroke-linecap:round;stroke-linejoin:round;stroke-miterlimit:16.8;paint-order:stroke fill markers"
         id="rect3"
         width="441.25766"
         height="356.72614"
         x="-2.4644871"
         y="1.9984014e-14"
         transform="matrix(-0.67325215,-0.73941297,0.72256139,-0.69130676,0,0)" /></clipPath><clipPath
       clipPathUnits="userSpaceOnUse"
       id="clipPath3"><rect
         style="opacity:0.264484;fill:#65cfd4;fill-rule:evenodd;stroke-width:11.0207;stroke-linecap:round;stroke-linejoin:round;stroke-miterlimit:16.8;paint-order:stroke fill markers"
         id="rect4"
         width="441.25766"
         height="356.72614"
         x="-2.4644871"
         y="1.9984014e-14"
         transform="matrix(-0.67325215,-0.73941297,0.72256139,-0.69130676,0,0)" /></clipPath><clipPath
       clipPathUnits="userSpaceOnUse"
       id="clipPath4"><rect
         style="opacity:0.264484;fill:#65cfd4;fill-rule:evenodd;stroke-width:11.0207;stroke-linecap:round;stroke-linejoin:round;stroke-miterlimit:16.8;paint-order:stroke fill markers"
         id="rect5"
         width="441.25766"
         height="356.72614"
         x="-2.4644871"
         y="1.9984014e-14"
         transform="matrix(-0.67325215,-0.73941297,0.72256139,-0.69130676,0,0)" /></clipPath><clipPath
       clipPathUnits="userSpaceOnUse"
       id="clipPath5"><rect
         style="opacity:0.264484;fill:#65cfd4;fill-rule:evenodd;stroke-width:11.0207;stroke-linecap:round;stroke-linejoin:round;stroke-miterlimit:16.8;paint-order:stroke fill markers"
         id="rect6"
         width="441.25766"
         height="356.72614"
         x="-2.4644871"
         y="1.9984014e-14"
         transform="matrix(-0.67325215,-0.73941297,0.72256139,-0.69130676,0,0)" /></clipPath><clipPath
       clipPathUnits="userSpaceOnUse"
       id="clipPath6"><rect
         style="opacity:0.264484;fill:#65cfd4;fill-rule:evenodd;stroke-width:11.0207;stroke-linecap:round;stroke-linejoin:round;stroke-miterlimit:16.8;paint-order:stroke fill markers"
         id="rect7"
         width="441.25766"
         height="356.72614"
         x="-2.4644871"
         y="1.9984014e-14"
         transform="matrix(-0.67325215,-0.73941297,0.72256139,-0.69130676,0,0)" /></clipPath><clipPath
       clipPathUnits="userSpaceOnUse"
       id="clipPath7"><rect
         style="opacity:0.264484;fill:#65cfd4;fill-rule:evenodd;stroke-width:11.0207;stroke-linecap:round;stroke-linejoin:round;stroke-miterlimit:16.8;paint-order:stroke fill markers"
         id="rect9"
         width="441.25766"
         height="356.72614"
         x="-2.4644871"
         y="1.9984014e-14"
         transform="matrix(-0.67325215,-0.73941297,0.72256139,-0.69130676,0,0)" /></clipPath></defs><g
     id="a"><path
       d="M -1.5867045,0 H 920.75 V 571.5 H -1.5867045 Z"
       style="fill:url(#f-9-1-6);stroke-width:0.95231;paint-order:normal"
       id="path4-7-6" /><rect
       style="opacity:0.264484;fill:#65cfd4;fill-rule:evenodd;stroke-width:10.4229;stroke-linecap:round;stroke-linejoin:round;stroke-miterlimit:16.8;paint-order:stroke fill markers"
       id="rect18-1"
       width="1101.9741"
       height="558.04773"
       x="-1354.5884"
       y="-1152.9503"
       transform="matrix(-0.7667581,0.64193614,-0.80794721,-0.58925488,0,0)" /><path
       d="M -1.5867045,0 H 920.75 V 571.5 H -1.5867045 Z"
       style="fill:url(#radialGradient11-7);fill-opacity:1;stroke-width:0.95231;paint-order:normal"
       id="path9-5" /><rect
       style="opacity:0.0851577;fill:#65cfd4;fill-rule:evenodd;stroke-width:10.4229;stroke-linecap:round;stroke-linejoin:round;stroke-miterlimit:16.8;paint-order:stroke fill markers"
       id="rect19-5"
       width="1101.9741"
       height="558.04773"
       x="-1282.0043"
       y="-1073.8773"
       transform="matrix(-0.7667581,0.64193614,-0.80794721,-0.58925488,0,0)" /><path
       d="M -1.5867045,0 H 920.75 V 571.5 H -1.5867045 Z"
       style="fill:url(#radialGradient14-0);fill-opacity:1;stroke-width:0.95231;paint-order:normal"
       id="path13-4" /><rect
       style="opacity:0.0851577;fill:#65cfd4;fill-rule:evenodd;stroke-width:10.4229;stroke-linecap:round;stroke-linejoin:round;stroke-miterlimit:16.8;paint-order:stroke fill markers"
       id="rect21-9"
       width="1101.9741"
       height="558.04773"
       x="-1407.8558"
       y="-816.87927"
       transform="matrix(-0.7667581,0.64193614,-0.80794721,-0.58925488,0,0)" /><rect
       style="opacity:0.0851577;fill:#65cfd4;fill-rule:evenodd;stroke-width:10.4229;stroke-linecap:round;stroke-linejoin:round;stroke-miterlimit:16.8;paint-order:stroke fill markers"
       id="rect22-3"
       width="1101.9741"
       height="558.04773"
       x="-1181.3894"
       y="-755.22552"
       transform="matrix(-0.7667581,0.64193614,-0.80794721,-0.58925488,0,0)" /><rect
       style="opacity:0.0851577;fill:#65cfd4;fill-rule:evenodd;stroke-width:10.4229;stroke-linecap:round;stroke-linejoin:round;stroke-miterlimit:16.8;paint-order:stroke fill markers"
       id="rect23-7"
       width="1101.9741"
       height="558.04773"
       x="-1262.4221"
       y="-476.20151"
       transform="matrix(-0.7667581,0.64193614,-0.80794721,-0.58925488,0,0)" /><rect
       style="opacity:0.0851577;fill:#65cfd4;fill-rule:evenodd;stroke-width:10.4229;stroke-linecap:round;stroke-linejoin:round;stroke-miterlimit:16.8;paint-order:stroke fill markers"
       id="rect24-4"
       width="1101.9741"
       height="558.04773"
       x="-1377.6903"
       y="390.2973"
       transform="matrix(-0.7667581,0.64193614,-0.80794721,-0.58925488,0,0)" /></g></svg>
