{
    "KPlugin": {
        "Authors": [
            {
                "Email": "devel@kali.org",
                "Name": "Kali Devel Team"
            }
        ],
        "Id": "KaliNeon",
        "Name": "Kali Neon",
        "License": "GPL-3.0+"
    }
}
