{
    "KPlugin": {
        "Authors": [
            {
                "Email": "devel@kali.org",
                "Name": "Kali Devel Team"
            }
        ],
        "Id": "Kali2014Blue1",
        "Name": "Kali 2014 Blue1",
        "License": "GPL-3.0+"
    }
}
