{
    "KPlugin": {
        "Authors": [
            {
                "Email": "devel@kali.org",
                "Name": "Kali Devel Team"
            }
        ],
        "Id": "BacktrackBlackhat2012R3a",
        "Name": "Backtrack Blackhat2012 R3a",
        "License": "GPL-3.0+"
    }
}
