{
    "KPackageStructure": "Plasma/LookAndFeel",
    "KPlugin": {
        "Authors": [
            {
                "Email": "devel@kali.org",
                "Name": "Kali Devel Team"
            }
        ],
        "Category": "",
        "Description": "Kali-Purple-Dark",
        "Id": "org.kali.kalipurpledark.desktop",
        "License": "GPL-3.0+",
        "Name": "Kali-Purple-Dark",
        "Website": "https://www.kali.org"
    }
}
