module helm.sh/helm/v3

go 1.23.0

require (
	github.com/AdaLogics/go-fuzz-headers v0.0.0-20230811130428-ced1acdcaa24
	github.com/BurntSushi/toml v1.4.0
	github.com/DATA-DOG/go-sqlmock v1.5.2
	github.com/Masterminds/semver/v3 v3.3.0
	github.com/Masterminds/sprig/v3 v3.3.0
	github.com/Masterminds/squirrel v1.5.4
	github.com/Masterminds/vcs v1.13.3
	github.com/asaskevich/govalidator v0.0.0-20230301143203-a9d515a09cc2
	github.com/containerd/containerd v1.7.24
	github.com/cyphar/filepath-securejoin v0.3.6
	github.com/distribution/distribution/v3 v3.0.0-20221208165359-362910506bc2
	github.com/evanphx/json-patch v5.9.0+incompatible
	github.com/foxcpp/go-mockdns v1.1.0
	github.com/gobwas/glob v0.2.3
	github.com/gofrs/flock v0.12.1
	github.com/gosuri/uitable v0.0.4
	github.com/hashicorp/go-multierror v1.1.1
	github.com/jmoiron/sqlx v1.4.0
	github.com/lib/pq v1.10.9
	github.com/mattn/go-shellwords v1.0.12
	github.com/mitchellh/copystructure v1.2.0
	github.com/moby/term v0.5.0
	github.com/opencontainers/image-spec v1.1.0
	github.com/phayes/freeport v0.0.0-20220201140144-74d24b5ae9f5
	github.com/pkg/errors v0.9.1
	github.com/rubenv/sql-migrate v1.7.1
	github.com/sirupsen/logrus v1.9.3
	github.com/spf13/cobra v1.8.1
	github.com/spf13/pflag v1.0.5
	github.com/stretchr/testify v1.10.0
	github.com/xeipuuv/gojsonschema v1.2.0
	golang.org/x/crypto v0.31.0
	golang.org/x/term v0.27.0
	golang.org/x/text v0.21.0
	k8s.io/api v0.32.0
	k8s.io/apiextensions-apiserver v0.32.0
	k8s.io/apimachinery v0.32.0
	k8s.io/apiserver v0.32.0
	k8s.io/cli-runtime v0.32.0
	k8s.io/client-go v0.32.0
	k8s.io/klog/v2 v2.130.1
	k8s.io/kubectl v0.32.0
	oras.land/oras-go v1.2.5
	sigs.k8s.io/yaml v1.4.0
)

require (
	dario.cat/mergo v1.0.1 // indirect
	github.com/Azure/go-ansiterm v0.0.0-20230124172434-306776ec8161 // indirect
	github.com/MakeNowJust/heredoc v1.0.0 // indirect
	github.com/Masterminds/goutils v1.1.1 // indirect
	github.com/Shopify/logrus-bugsnag v0.0.0-20171204204709-577dee27f20d // indirect
	github.com/beorn7/perks v1.0.1 // indirect
	github.com/blang/semver/v4 v4.0.0 // indirect
	github.com/bshuster-repo/logrus-logstash-hook v1.0.0 // indirect
	github.com/bugsnag/bugsnag-go v0.0.0-20141110184014-b1d153021fcd // indirect
	github.com/bugsnag/osext v0.0.0-20130617224835-0dd3f918b21b // indirect
	github.com/bugsnag/panicwrap v0.0.0-20151223152923-e2c28503fcd0 // indirect
	github.com/cespare/xxhash/v2 v2.3.0 // indirect
	github.com/chai2010/gettext-go v1.0.2 // indirect
	github.com/containerd/errdefs v0.3.0 // indirect
	github.com/containerd/log v0.1.0 // indirect
	github.com/containerd/platforms v0.2.1 // indirect
	github.com/cpuguy83/go-md2man/v2 v2.0.4 // indirect
	github.com/davecgh/go-spew v1.1.2-0.20180830191138-d8f796af33cc // indirect
	github.com/distribution/reference v0.6.0 // indirect
	github.com/docker/cli v25.0.1+incompatible // indirect
	github.com/docker/distribution v2.8.3+incompatible // indirect
	github.com/docker/docker v25.0.6+incompatible // indirect
	github.com/docker/docker-credential-helpers v0.7.0 // indirect
	github.com/docker/go-connections v0.5.0 // indirect
	github.com/docker/go-events v0.0.0-20190806004212-e31b211e4f1c // indirect
	github.com/docker/go-metrics v0.0.1 // indirect
	github.com/docker/libtrust v0.0.0-20150114040149-fa567046d9b1 // indirect
	github.com/emicklei/go-restful/v3 v3.11.0 // indirect
	github.com/exponent-io/jsonpath v0.0.0-20210407135951-1de76d718b3f // indirect
	github.com/fatih/color v1.13.0 // indirect
	github.com/felixge/httpsnoop v1.0.4 // indirect
	github.com/fxamacker/cbor/v2 v2.7.0 // indirect
	github.com/go-errors/errors v1.4.2 // indirect
	github.com/go-gorp/gorp/v3 v3.1.0 // indirect
	github.com/go-logr/logr v1.4.2 // indirect
	github.com/go-logr/stdr v1.2.2 // indirect
	github.com/go-openapi/jsonpointer v0.21.0 // indirect
	github.com/go-openapi/jsonreference v0.20.2 // indirect
	github.com/go-openapi/swag v0.23.0 // indirect
	github.com/gogo/protobuf v1.3.2 // indirect
	github.com/golang/protobuf v1.5.4 // indirect
	github.com/gomodule/redigo v1.8.2 // indirect
	github.com/google/btree v1.0.1 // indirect
	github.com/google/gnostic-models v0.6.8 // indirect
	github.com/google/go-cmp v0.6.0 // indirect
	github.com/google/gofuzz v1.2.0 // indirect
	github.com/google/shlex v0.0.0-20191202100458-e7afc7fbc510 // indirect
	github.com/google/uuid v1.6.0 // indirect
	github.com/gorilla/handlers v1.5.1 // indirect
	github.com/gorilla/mux v1.8.0 // indirect
	github.com/gorilla/websocket v1.5.0 // indirect
	github.com/gregjones/httpcache v0.0.0-20190611155906-901d90724c79 // indirect
	github.com/hashicorp/errwrap v1.1.0 // indirect
	github.com/hashicorp/golang-lru v0.5.4 // indirect
	github.com/huandu/xstrings v1.5.0 // indirect
	github.com/inconshreveable/mousetrap v1.1.0 // indirect
	github.com/josharian/intern v1.0.0 // indirect
	github.com/json-iterator/go v1.1.12 // indirect
	github.com/klauspost/compress v1.16.7 // indirect
	github.com/lann/builder v0.0.0-20180802200727-47ae307949d0 // indirect
	github.com/lann/ps v0.0.0-20150810152359-62de8c46ede0 // indirect
	github.com/liggitt/tabwriter v0.0.0-20181228230101-89fcab3d43de // indirect
	github.com/mailru/easyjson v0.7.7 // indirect
	github.com/mattn/go-colorable v0.1.13 // indirect
	github.com/mattn/go-isatty v0.0.17 // indirect
	github.com/mattn/go-runewidth v0.0.9 // indirect
	github.com/miekg/dns v1.1.57 // indirect
	github.com/mitchellh/go-wordwrap v1.0.1 // indirect
	github.com/mitchellh/reflectwalk v1.0.2 // indirect
	github.com/moby/locker v1.0.1 // indirect
	github.com/moby/spdystream v0.5.0 // indirect
	github.com/modern-go/concurrent v0.0.0-20180306012644-bacd9c7ef1dd // indirect
	github.com/modern-go/reflect2 v1.0.2 // indirect
	github.com/monochromegane/go-gitignore v0.0.0-20200626010858-205db1a8cc00 // indirect
	github.com/munnerz/goautoneg v0.0.0-20191010083416-a7dc8b61c822 // indirect
	github.com/mxk/go-flowrate v0.0.0-20140419014527-cca7078d478f // indirect
	github.com/opencontainers/go-digest v1.0.0 // indirect
	github.com/peterbourgon/diskv v2.0.1+incompatible // indirect
	github.com/pmezard/go-difflib v1.0.1-0.20181226105442-5d4384ee4fb2 // indirect
	github.com/prometheus/client_golang v1.19.1 // indirect
	github.com/prometheus/client_model v0.6.1 // indirect
	github.com/prometheus/common v0.55.0 // indirect
	github.com/prometheus/procfs v0.15.1 // indirect
	github.com/russross/blackfriday/v2 v2.1.0 // indirect
	github.com/shopspring/decimal v1.4.0 // indirect
	github.com/spf13/cast v1.7.0 // indirect
	github.com/x448/float16 v0.8.4 // indirect
	github.com/xeipuuv/gojsonpointer v0.0.0-20190905194746-02993c407bfb // indirect
	github.com/xeipuuv/gojsonreference v0.0.0-20180127040603-bd5ef7bd5415 // indirect
	github.com/xlab/treeprint v1.2.0 // indirect
	github.com/yvasiyarov/go-metrics v0.0.0-20140926110328-57bccd1ccd43 // indirect
	github.com/yvasiyarov/gorelic v0.0.0-20141212073537-a9bba5b9ab50 // indirect
	github.com/yvasiyarov/newrelic_platform_go v0.0.0-20140908184405-b21fdbd4370f // indirect
	go.opentelemetry.io/contrib/instrumentation/net/http/otelhttp v0.53.0 // indirect
	go.opentelemetry.io/otel v1.28.0 // indirect
	go.opentelemetry.io/otel/metric v1.28.0 // indirect
	go.opentelemetry.io/otel/trace v1.28.0 // indirect
	golang.org/x/mod v0.21.0 // indirect
	golang.org/x/net v0.33.0 // indirect
	golang.org/x/oauth2 v0.23.0 // indirect
	golang.org/x/sync v0.10.0 // indirect
	golang.org/x/sys v0.28.0 // indirect
	golang.org/x/time v0.7.0 // indirect
	golang.org/x/tools v0.26.0 // indirect
	google.golang.org/genproto/googleapis/rpc v0.0.0-20240826202546-f6391c0de4c7 // indirect
	google.golang.org/grpc v1.65.0 // indirect
	google.golang.org/protobuf v1.35.1 // indirect
	gopkg.in/evanphx/json-patch.v4 v4.12.0 // indirect
	gopkg.in/inf.v0 v0.9.1 // indirect
	gopkg.in/yaml.v2 v2.4.0 // indirect
	gopkg.in/yaml.v3 v3.0.1 // indirect
	k8s.io/component-base v0.32.0 // indirect
	k8s.io/kube-openapi v0.0.0-20241105132330-32ad38e42d3f // indirect
	k8s.io/utils v0.0.0-20241104100929-3ea5e8cea738 // indirect
	sigs.k8s.io/json v0.0.0-20241010143419-9aa6b5e7a4b3 // indirect
	sigs.k8s.io/kustomize/api v0.18.0 // indirect
	sigs.k8s.io/kustomize/kyaml v0.18.1 // indirect
	sigs.k8s.io/structured-merge-diff/v4 v4.4.2 // indirect
)
