module github.com/Ne0nd0g/ja3transport

go 1.13

require (
	github.com/refraction-networking/utls v0.0.0-20200820030103-33a29038e742
	golang.org/x/crypto v0.0.0-20201016220609-9e8e0b390897 // indirect
	golang.org/x/net v0.0.0-20191119073136-fc4aabc6c914
	golang.org/x/sys v0.0.0-20201029080932-201ba4db2418 // indirect
)
