<?xml version="1.0" encoding="UTF-8" standalone="no"?>
<!-- Created with Inkscape (http://www.inkscape.org/) -->

<svg
   xmlns:dc="http://purl.org/dc/elements/1.1/"
   xmlns:cc="http://creativecommons.org/ns#"
   xmlns:rdf="http://www.w3.org/1999/02/22-rdf-syntax-ns#"
   xmlns:svg="http://www.w3.org/2000/svg"
   xmlns="http://www.w3.org/2000/svg"
   xmlns:xlink="http://www.w3.org/1999/xlink"
   xmlns:sodipodi="http://sodipodi.sourceforge.net/DTD/sodipodi-0.dtd"
   xmlns:inkscape="http://www.inkscape.org/namespaces/inkscape"
   width="76"
   height="27"
   id="svg11252"
   version="1.1"
   inkscape:version="0.48.4 r9939"
   sodipodi:docname="dash-placeholder.svg">
  <metadata
     id="metadata19">
    <rdf:RDF>
      <cc:Work
         rdf:about="">
        <dc:format>image/svg+xml</dc:format>
        <dc:type
           rdf:resource="http://purl.org/dc/dcmitype/StillImage" />
      </cc:Work>
    </rdf:RDF>
  </metadata>
  <sodipodi:namedview
     pagecolor="#ffffff"
     bordercolor="#666666"
     borderopacity="1"
     objecttolerance="10"
     gridtolerance="10"
     guidetolerance="10"
     inkscape:pageopacity="0"
     inkscape:pageshadow="2"
     inkscape:window-width="1600"
     inkscape:window-height="847"
     id="namedview17"
     showgrid="false"
     inkscape:zoom="3.7894737"
     inkscape:cx="-17.8125"
     inkscape:cy="13.5"
     inkscape:window-x="0"
     inkscape:window-y="24"
     inkscape:window-maximized="1"
     inkscape:current-layer="svg11252" />
  <defs
     id="defs11254">
    <radialGradient
       xlink:href="#linearGradient39563-4-2"
       id="radialGradient68155-2-3"
       gradientUnits="userSpaceOnUse"
       gradientTransform="matrix(1,0,0,0.3486842,0,317.8421)"
       cx="49"
       cy="488"
       fx="49"
       fy="488"
       r="38" />
    <linearGradient
       id="linearGradient39563-4-2">
      <stop
         style="stop-color:#ffffff;stop-opacity:1;"
         offset="0"
         id="stop39565-1-4" />
      <stop
         style="stop-color:#ffffff;stop-opacity:0;"
         offset="1"
         id="stop39567-7-9" />
    </linearGradient>
    <radialGradient
       xlink:href="#linearGradient39573-6-1"
       id="radialGradient68157-0-8"
       gradientUnits="userSpaceOnUse"
       cx="50.5"
       cy="487.5"
       fx="50.5"
       fy="487.5"
       r="10.5" />
    <linearGradient
       id="linearGradient39573-6-1">
      <stop
         style="stop-color:#ffffff;stop-opacity:1;"
         offset="0"
         id="stop39575-5-6" />
      <stop
         style="stop-color:#ffffff;stop-opacity:0;"
         offset="1"
         id="stop39577-1-2" />
    </linearGradient>
    <filter
       id="filter2996"
       inkscape:label="Colorize"
       inkscape:menu="Color"
       inkscape:menu-tooltip="Blend image or object with a flood color and set lightness and contrast"
       x="0"
       y="0"
       width="1"
       height="1"
       color-interpolation-filters="sRGB">
      <feColorMatrix
         id="feColorMatrix2998"
         values="141.72413793103448"
         in="SourceGraphic"
         type="hueRotate"
         result="result2" />
      <feFlood
         id="feFlood3000"
         flood-color="rgb(109,185,213)"
         flood-opacity="1"
         result="result1" />
      <feBlend
         id="feBlend3002"
         in2="result2"
         mode="multiply"
         in="result1"
         result="result3" />
      <feComposite
         id="feComposite3004"
         in2="SourceGraphic"
         operator="in"
         k2="1"
         result="result4" />
    </filter>
  </defs>
  <g
     id="layer1"
     transform="translate(-337,-518.86218)"
     style="filter:url(#filter2996)">
    <g
       id="g99967"
       style="display:inline"
       transform="translate(326,44.862171)">
      <rect
         style="opacity:0.49375;color:#000000;fill:url(#radialGradient68155-2-3);fill-opacity:1;stroke:none;stroke-width:1;marker:none;visibility:visible;display:inline;overflow:visible;enable-background:accumulate"
         id="rect99969"
         width="76"
         height="2"
         x="11"
         y="487"
         rx="0"
         ry="0" />
      <path
         style="opacity:0.43125;color:#000000;fill:url(#radialGradient68157-0-8);fill-opacity:1;fill-rule:nonzero;stroke:none;stroke-width:1;marker:none;visibility:visible;display:inline;overflow:visible;enable-background:accumulate"
         id="path99971"
         d="M 61,487.5 C 61,493.29899 56.29899,498 50.5,498 44.70101,498 40,493.29899 40,487.5 40,481.70101 44.70101,477 50.5,477 c 5.79899,0 10.5,4.70101 10.5,10.5 z"
         transform="matrix(1.2857143,0,0,1.2857143,-14.428572,-139.28571)" />
      <path
         transform="matrix(0.43589747,0,0,0.43589747,28.487179,275)"
         d="M 61,487.5 C 61,493.29899 56.29899,498 50.5,498 44.70101,498 40,493.29899 40,487.5 40,481.70101 44.70101,477 50.5,477 c 5.79899,0 10.5,4.70101 10.5,10.5 z"
         id="path99973"
         style="color:#000000;fill:#ffffff;fill-opacity:1;fill-rule:nonzero;stroke:none;stroke-width:1;marker:none;visibility:visible;display:inline;overflow:visible;enable-background:accumulate" />
    </g>
  </g>
</svg>
