{
  "coordinates": [
    [
      [
        [
          91.87353612795528,
          25.63984282963134
        ],
        [
          91.8739351988818,
          25.64020231276498
        ],
        [
          91.8739351988818,
          25.64083140824885
        ],
        [
          91.87323682476038,
          25.64146050373272
        ],
        [
          91.87273798610224,
          25.64146050373272
        ],
        [
          91.87253845063898,
          25.6412807621659
        ],
        [
          91.87253845063898,
          25.64029218354839
        ],
        [
          91.8729375215655,
          25.63993270041475
        ],
        [
          91.8729375215655,
          25.63966308806452
        ],
        [
          91.87313705702876,
          25.63966308806452
        ],
        [
          91.87313705702876,
          25.63921373414746
        ],
        [
          91.87283775383386,
          25.63921373414746
        ],
        [
          91.87263821837061,
          25.63957321728111
        ],
        [
          91.87223914744409,
          25.63957321728111
        ],
        [
          91.87223914744409,
          25.63921373414746
        ],
        [
          91.87203961198084,
          25.63921373414746
        ],
        [
          91.87184007651757,
          25.63894412179723
        ],
        [
          91.87064286373803,
          25.63894412179723
        ],
        [
          91.87064286373803,
          25.63939347571429
        ],
        [
          91.87044332827476,
          25.63939347571429
        ],
        [
          91.87034356054313,
          25.63921373414746
        ],
        [
          91.87004425734824,
          25.63921373414746
        ],
        [
          91.86984472188499,
          25.63948334649769
        ],
        [
          91.86914634776358,
          25.63939347571429
        ],
        [
          91.86894681230032,
          25.63912386336406
        ],
        [
          91.8685477413738,
          25.63921373414746
        ],
        [
          91.86834820591055,
          25.63903399258065
        ],
        [
          91.86834820591055,
          25.63876438023041
        ],
        [
          91.86794913498403,
          25.63849476788018
        ],
        [
          91.86794913498403,
          25.63786567239631
        ],
        [
          91.86745029632588,
          25.63804541396313
        ],
        [
          91.86755006405751,
          25.638674509447
        ],
        [
          91.86735052859426,
          25.638674509447
        ],
        [
          91.86685168993611,
          25.63795554317972
        ],
        [
          91.8661533158147,
          25.63759606004608
        ],
        [
          91.86605354808307,
          25.63705683534562
        ],
        [
          91.86575424488818,
          25.63696696456221
        ],
        [
          91.8658540126198,
          25.63669735221198
        ],
        [
          91.86605354808307,
          25.63669735221198
        ],
        [
          91.86605354808307,
          25.63624799829493
        ],
        [
          91.86565447715655,
          25.6359783859447
        ],
        [
          91.86555470942493,
          25.63561890281106
        ],
        [
          91.86535517396166,
          25.63561890281106
        ],
        [
          91.86525540623003,
          25.6359783859447
        ],
        [
          91.86485633530351,
          25.63588851516129
        ],
        [
          91.86485633530351,
          25.63552903202765
        ],
        [
          91.86505587076678,
          25.63552903202765
        ],
        [
          91.86535517396166,
          25.6350796781106
        ],
        [
          91.86485633530351,
          25.63472019497696
        ],
        [
          91.86475656757189,
          25.63427084105991
        ],
        [
          91.86405819345049,
          25.63400122870968
        ],
        [
          91.86296074840256,
          25.63400122870968
        ],
        [
          91.86266144520768,
          25.63373161635945
        ],
        [
          91.86266144520768,
          25.63310252087557
        ],
        [
          91.86236214201278,
          25.63283290852534
        ],
        [
          91.86156400015975,
          25.63265316695853
        ],
        [
          91.86116492923323,
          25.63220381304147
        ],
        [
          91.86056632284345,
          25.63211394225806
        ],
        [
          91.86026701964856,
          25.63175445912442
        ],
        [
          91.85887027140575,
          25.63175445912442
        ],
        [
          91.85857096821087,
          25.63211394225806
        ],
        [
          91.85827166501598,
          25.63211394225806
        ],
        [
          91.85807212955272,
          25.63247342539171
        ],
        [
          91.85747352316294,
          25.63247342539171
        ],
        [
          91.85827166501598,
          25.63319239165899
        ],
        [
          91.8583714327476,
          25.63382148714286
        ],
        [
          91.85877050367412,
          25.63409109949309
        ],
        [
          91.85877050367412,
          25.63481006576037
        ],
        [
          91.85817189728435,
          25.63498980732719
        ],
        [
          91.85857096821087,
          25.63543916124424
        ],
        [
          91.85887027140575,
          25.63552903202765
        ],
        [
          91.85877050367412,
          25.63579864437788
        ],
        [
          91.85916957460064,
          25.63606825672811
        ],
        [
          91.85916957460064,
          25.63768593082949
        ],
        [
          91.86016725191693,
          25.63822515552995
        ],
        [
          91.86006748418531,
          25.63894412179723
        ],
        [
          91.86026701964856,
          25.63912386336406
        ],
        [
          91.86026701964856,
          25.63948334649769
        ],
        [
          91.86046655511183,
          25.63984282963134
        ],
        [
          91.86086562603835,
          25.64011244198157
        ],
        [
          91.86096539376997,
          25.64047192511521
        ],
        [
          91.86116492923323,
          25.64056179589862
        ],
        [
          91.86146423242812,
          25.64155037451613
        ],
        [
          91.86176353562301,
          25.64173011608295
        ],
        [
          91.86176353562301,
          25.64271869470046
        ],
        [
          91.86146423242812,
          25.64271869470046
        ],
        [
          91.86146423242812,
          25.64298830705069
        ],
        [
          91.86186330335464,
          25.6430781778341
        ],
        [
          91.86186330335464,
          25.64334779018433
        ],
        [
          91.86136446469649,
          25.64361740253456
        ],
        [
          91.86056632284345,
          25.64361740253456
        ],
        [
          91.85996771645368,
          25.64415662723502
        ],
        [
          91.85986794872206,
          25.64460598115207
        ],
        [
          91.85897003913739,
          25.64523507663595
        ],
        [
          91.85887027140575,
          25.64577430133641
        ],
        [
          91.85817189728435,
          25.64577430133641
        ],
        [
          91.85787259408946,
          25.64595404290323
        ],
        [
          91.85787259408946,
          25.64613378447005
        ],
        [
          91.85827166501598,
          25.64613378447005
        ],
        [
          91.85847120047924,
          25.64640339682028
        ],
        [
          91.85956864552716,
          25.64631352603687
        ],
        [
          91.85976818099041,
          25.645684430553
        ],
        [
          91.86016725191693,
          25.64550468898618
        ],
        [
          91.86026701964856,
          25.6448755935023
        ],
        [
          91.86066609057508,
          25.64478572271889
        ],
        [
          91.8607658583067,
          25.64415662723502
        ],
        [
          91.86256167747604,
          25.64415662723502
        ],
        [
          91.86236214201278,
          25.64361740253456
        ],
        [
          91.8627612129393,
          25.64334779018433
        ],
        [
          91.86286098067093,
          25.64280856548387
        ],
        [
          91.8634595870607,
          25.64280856548387
        ],
        [
          91.86365912252397,
          25.6430781778341
        ],
        [
          91.86485633530351,
          25.6430781778341
        ],
        [
          91.86525540623003,
          25.64235921156682
        ],
        [
          91.8661533158147,
          25.64244908235023
        ],
        [
          91.86645261900959,
          25.64208959921659
        ],
        [
          91.86695145766774,
          25.64208959921659
        ],
        [
          91.86745029632588,
          25.64253895313364
        ],
        [
          91.86745029632588,
          25.64334779018433
        ],
        [
          91.86804890271566,
          25.64388701488479
        ],
        [
          91.86834820591055,
          25.64388701488479
        ],
        [
          91.8688470445687,
          25.64451611036866
        ],
        [
          91.8695454186901,
          25.64442623958525
        ],
        [
          91.86994448961661,
          25.6439768856682
        ],
        [
          91.87084239920128,
          25.6439768856682
        ],
        [
          91.87104193466455,
          25.64424649801843
        ],
        [
          91.87174030878595,
          25.64415662723502
        ],
        [
          91.87213937971246,
          25.64298830705069
        ],
        [
          91.87273798610224,
          25.64298830705069
        ],
        [
          91.87263821837061,
          25.64352753175115
        ],
        [
          91.87243868290736,
          25.64361740253456
        ],
        [
          91.87243868290736,
          25.6439768856682
        ],
        [
          91.87184007651757,
          25.64424649801843
        ],
        [
          91.87064286373803,
          25.64532494741935
        ],
        [
          91.86904658003195,
          25.64559455976958
        ],
        [
          91.8688470445687,
          25.64532494741935
        ],
        [
          91.86804890271566,
          25.64550468898618
        ],
        [
          91.86764983178914,
          25.64505533506912
        ],
        [
          91.86705122539936,
          25.64514520585253
        ],
        [
          91.86725076086262,
          25.64550468898618
        ],
        [
          91.86725076086262,
          25.64721223387097
        ],
        [
          91.86675192220447,
          25.6474818462212
        ],
        [
          91.86725076086262,
          25.6474818462212
        ],
        [
          91.86745029632588,
          25.64730210465438
        ],
        [
          91.86755006405751,
          25.64649326760369
        ],
        [
          91.86814867044728,
          25.64649326760369
        ],
        [
          91.86824843817892,
          25.64667300917051
        ],
        [
          91.86894681230032,
          25.64667300917051
        ],
        [
          91.86904658003195,
          25.64649326760369
        ],
        [
          91.8695454186901,
          25.6465831383871
        ],
        [
          91.8695454186901,
          25.64631352603687
        ],
        [
          91.86974495415336,
          25.64613378447005
        ],
        [
          91.87064286373803,
          25.64613378447005
        ],
        [
          91.87074263146965,
          25.64595404290323
        ],
        [
          91.8712414701278,
          25.64586417211981
        ],
        [
          91.87144100559105,
          25.64559455976958
        ],
        [
          91.87243868290736,
          25.64532494741935
        ],
        [
          91.87283775383386,
          25.64478572271889
        ],
        [
          91.87373566341853,
          25.64415662723502
        ],
        [
          91.8736358956869,
          25.64352753175115
        ],
        [
          91.87403496661342,
          25.64325791940092
        ],
        [
          91.87403496661342,
          25.64280856548387
        ],
        [
          91.87373566341853,
          25.64262882391705
        ],
        [
          91.87383543115017,
          25.64235921156682
        ],
        [
          91.87433426980832,
          25.64226934078341
        ],
        [
          91.87473334073482,
          25.64298830705069
        ],
        [
          91.87483310846646,
          25.64244908235023
        ],
        [
          91.87523217939298,
          25.64199972843318
        ],
        [
          91.876030321246,
          25.64199972843318
        ],
        [
          91.87662892763579,
          25.64253895313364
        ],
        [
          91.87722753402556,
          25.64262882391705
        ],
        [
          91.87762660495208,
          25.64289843626728
        ],
        [
          91.87762660495208,
          25.64334779018433
        ],
        [
          91.87722753402556,
          25.64334779018433
        ],
        [
          91.87712776629394,
          25.64352753175115
        ],
        [
          91.87732730175719,
          25.64370727331797
        ],
        [
          91.87772637268371,
          25.64370727331797
        ],
        [
          91.87792590814696,
          25.64406675645161
        ],
        [
          91.87772637268371,
          25.64433636880184
        ],
        [
          91.87722753402556,
          25.64424649801843
        ],
        [
          91.87652915990415,
          25.64442623958525
        ],
        [
          91.87613008897763,
          25.6448755935023
        ],
        [
          91.87613008897763,
          25.645684430553
        ],
        [
          91.87563125031949,
          25.64577430133641
        ],
        [
          91.87553148258786,
          25.64640339682028
        ],
        [
          91.87593055351438,
          25.64649326760369
        ],
        [
          91.876030321246,
          25.64685275073733
        ],
        [
          91.8763296244409,
          25.64703249230415
        ],
        [
          91.87622985670927,
          25.6474818462212
        ],
        [
          91.87543171485623,
          25.64766158778802
        ],
        [
          91.87443403753994,
          25.64739197543779
        ],
        [
          91.87273798610224,
          25.64739197543779
        ],
        [
          91.87263821837061,
          25.64757171700461
        ],
        [
          91.8736358956869,
          25.64775145857143
        ],
        [
          91.8739351988818,
          25.64829068327189
        ],
        [
          91.87453380527157,
          25.64829068327189
        ],
        [
          91.87483310846646,
          25.64909952032258
        ],
        [
          91.87503264392971,
          25.64900964953917
        ],
        [
          91.87503264392971,
          25.64847042483871
        ],
        [
          91.87662892763579,
          25.64820081248848
        ],
        [
          91.87692823083067,
          25.64775145857143
        ],
        [
          91.87772637268371,
          25.64784132935484
        ],
        [
          91.87792590814696,
          25.64829068327189
        ],
        [
          91.87862428226838,
          25.64891977875576
        ],
        [
          91.87882381773163,
          25.64891977875576
        ],
        [
          91.87842474680511,
          25.64856029562212
        ],
        [
          91.87832497907348,
          25.64793120013825
        ],
        [
          91.8770279985623,
          25.64694262152074
        ],
        [
          91.87692823083067,
          25.64640339682028
        ],
        [
          91.87722753402556,
          25.64631352603687
        ],
        [
          91.87732730175719,
          25.64595404290323
        ],
        [
          91.87852451453675,
          25.64559455976958
        ],
        [
          91.8790233531949,
          25.645684430553
        ],
        [
          91.87922288865815,
          25.64604391368664
        ],
        [
          91.87952219185304,
          25.64604391368664
        ],
        [
          91.87952219185304,
          25.645684430553
        ],
        [
          91.87922288865815,
          25.64550468898618
        ],
        [
          91.87922288865815,
          25.64532494741935
        ],
        [
          91.8794224241214,
          25.64523507663595
        ],
        [
          91.8797217273163,
          25.64523507663595
        ],
        [
          91.8804201014377,
          25.64595404290323
        ],
        [
          91.8821161528754,
          25.64622365525346
        ],
        [
          91.8821161528754,
          25.6465831383871
        ],
        [
          91.88191661741214,
          25.64667300917051
        ],
        [
          91.88191661741214,
          25.64739197543779
        ],
        [
          91.88161731421725,
          25.64757171700461
        ],
        [
          91.88161731421725,
          25.64811094170507
        ],
        [
          91.88191661741214,
          25.64811094170507
        ],
        [
          91.88201638514377,
          25.64775145857143
        ],
        [
          91.88261499153354,
          25.64721223387097
        ],
        [
          91.88321359792333,
          25.64721223387097
        ],
        [
          91.88331336565496,
          25.64640339682028
        ],
        [
          91.88361266884984,
          25.64640339682028
        ],
        [
          91.884111507508,
          25.64685275073733
        ],
        [
          91.88421127523962,
          25.64739197543779
        ],
        [
          91.88500941709265,
          25.64775145857143
        ],
        [
          91.88580755894569,
          25.64847042483871
        ],
        [
          91.88570779121406,
          25.64865016640553
        ],
        [
          91.88500941709265,
          25.64847042483871
        ],
        [
          91.88401173977635,
          25.64775145857143
        ],
        [
          91.8838122043131,
          25.64739197543779
        ],
        [
          91.88321359792333,
          25.64730210465438
        ],
        [
          91.88321359792333,
          25.64802107092166
        ],
        [
          91.88361266884984,
          25.6483805540553
        ],
        [
          91.88421127523962,
          25.6483805540553
        ],
        [
          91.88441081070287,
          25.64900964953917
        ],
        [
          91.8855082557508,
          25.64972861580645
        ],
        [
          91.88540848801917,
          25.6501779697235
        ],
        [
          91.88500941709265,
          25.65053745285714
        ],
        [
          91.88461034616614,
          25.65044758207373
        ],
        [
          91.8845105784345,
          25.65026784050691
        ],
        [
          91.88391197204473,
          25.65026784050691
        ],
        [
          91.8838122043131,
          25.65080706520737
        ],
        [
          91.88431104297125,
          25.65098680677419
        ],
        [
          91.8845105784345,
          25.65116654834101
        ],
        [
          91.8845105784345,
          25.65143616069124
        ],
        [
          91.8848098816294,
          25.65152603147465
        ],
        [
          91.88500941709265,
          25.65179564382488
        ],
        [
          91.88520895255591,
          25.65179564382488
        ],
        [
          91.88560802348243,
          25.65143616069124
        ],
        [
          91.88610686214058,
          25.65134628990783
        ],
        [
          91.88640616533546,
          25.65089693599078
        ],
        [
          91.88660570079873,
          25.65089693599078
        ],
        [
          91.88680523626198,
          25.65125641912442
        ],
        [
          91.88680523626198,
          25.65224499774193
        ],
        [
          91.88760337811502,
          25.65242473930876
        ],
        [
          91.88780291357827,
          25.65260448087558
        ],
        [
          91.88710453945687,
          25.65314370557604
        ],
        [
          91.88670546853035,
          25.65314370557604
        ],
        [
          91.88670546853035,
          25.65296396400922
        ],
        [
          91.88630639760383,
          25.65269435165899
        ],
        [
          91.88610686214058,
          25.65287409322581
        ],
        [
          91.88530872028754,
          25.65287409322581
        ],
        [
          91.88520895255591,
          25.65386267184332
        ],
        [
          91.88560802348243,
          25.65386267184332
        ],
        [
          91.88590732667731,
          25.65467150889401
        ],
        [
          91.88630639760383,
          25.65485125046083
        ],
        [
          91.88630639760383,
          25.65530060437788
        ],
        [
          91.88610686214058,
          25.6554803459447
        ],
        [
          91.88540848801917,
          25.6554803459447
        ],
        [
          91.88500941709265,
          25.65512086281106
        ],
        [
          91.8845105784345,
          25.65512086281106
        ],
        [
          91.884111507508,
          25.65476137967742
        ],
        [
          91.884111507508,
          25.6545816381106
        ],
        [
          91.88361266884984,
          25.65422215497696
        ],
        [
          91.88371243658148,
          25.65386267184332
        ],
        [
          91.88351290111821,
          25.6536829302765
        ],
        [
          91.88251522380192,
          25.65341331792627
        ],
        [
          91.8821161528754,
          25.65314370557604
        ],
        [
          91.8821161528754,
          25.65296396400922
        ],
        [
          91.88181684968052,
          25.65287409322581
        ],
        [
          91.88171708194888,
          25.65260448087558
        ],
        [
          91.88121824329073,
          25.65251461009217
        ],
        [
          91.88061963690096,
          25.6519753853917
        ],
        [
          91.88061963690096,
          25.65161590225807
        ],
        [
          91.88032033370607,
          25.65125641912442
        ],
        [
          91.8804201014377,
          25.65206525617512
        ],
        [
          91.88071940463259,
          25.65233486852535
        ],
        [
          91.88061963690096,
          25.65314370557604
        ],
        [
          91.88101870782748,
          25.65323357635945
        ],
        [
          91.881417778754,
          25.65359305949309
        ],
        [
          91.88131801102237,
          25.65413228419355
        ],
        [
          91.88101870782748,
          25.65422215497696
        ],
        [
          91.88101870782748,
          25.65440189654378
        ],
        [
          91.88061963690096,
          25.65449176732719
        ],
        [
          91.8804201014377,
          25.65485125046083
        ],
        [
          91.88181684968052,
          25.65476137967742
        ],
        [
          91.88221592060702,
          25.65503099202765
        ],
        [
          91.88221592060702,
          25.65530060437788
        ],
        [
          91.88311383019169,
          25.65512086281106
        ],
        [
          91.88341313338658,
          25.65539047516129
        ],
        [
          91.88341313338658,
          25.65557021672811
        ],
        [
          91.88301406246006,
          25.65566008751152
        ],
        [
          91.88251522380192,
          25.65628918299539
        ],
        [
          91.88201638514377,
          25.65619931221198
        ],
        [
          91.88191661741214,
          25.65673853691244
        ],
        [
          91.88171708194888,
          25.65673853691244
        ],
        [
          91.881417778754,
          25.6563790537788
        ],
        [
          91.88101870782748,
          25.6563790537788
        ],
        [
          91.88081917236421,
          25.65655879534562
        ],
        [
          91.88081917236421,
          25.65745750317972
        ],
        [
          91.88051986916933,
          25.65772711552995
        ],
        [
          91.88022056597444,
          25.65772711552995
        ],
        [
          91.88032033370607,
          25.65799672788019
        ],
        [
          91.8811184755591,
          25.65790685709677
        ],
        [
          91.88121824329073,
          25.65808659866359
        ],
        [
          91.8821161528754,
          25.65808659866359
        ],
        [
          91.88231568833866,
          25.65772711552995
        ],
        [
          91.88271475926518,
          25.65763724474654
        ],
        [
          91.88261499153354,
          25.65835621101382
        ],
        [
          91.88221592060702,
          25.65844608179724
        ],
        [
          91.88191661741214,
          25.6589853064977
        ],
        [
          91.88081917236421,
          25.65907517728111
        ],
        [
          91.88081917236421,
          25.65925491884793
        ],
        [
          91.88101870782748,
          25.65934478963134
        ],
        [
          91.88091894009585,
          25.65979414354839
        ],
        [
          91.8811184755591,
          25.65997388511521
        ],
        [
          91.88161731421725,
          25.65961440198157
        ],
        [
          91.88231568833866,
          25.65961440198157
        ],
        [
          91.88261499153354,
          25.66015362668203
        ],
        [
          91.88301406246006,
          25.66006375589862
        ],
        [
          91.88311383019169,
          25.66096246373272
        ],
        [
          91.88291429472844,
          25.66105233451613
        ],
        [
          91.88291429472844,
          25.66150168843318
        ],
        [
          91.88311383019169,
          25.66159155921659
        ],
        [
          91.88311383019169,
          25.66213078391705
        ],
        [
          91.88251522380192,
          25.66222065470046
        ],
        [
          91.88191661741214,
          25.66186117156682
        ],
        [
          91.88171708194888,
          25.66186117156682
        ],
        [
          91.88151754648563,
          25.66213078391705
        ],
        [
          91.8804201014377,
          25.66204091313364
        ],
        [
          91.8797217273163,
          25.66159155921659
        ],
        [
          91.8794224241214,
          25.66159155921659
        ],
        [
          91.87922288865815,
          25.66195104235023
        ],
        [
          91.8794224241214,
          25.66213078391705
        ],
        [
          91.88071940463259,
          25.66231052548387
        ],
        [
          91.88071940463259,
          25.66267000861751
        ],
        [
          91.88101870782748,
          25.66284975018433
        ],
        [
          91.88101870782748,
          25.66329910410138
        ],
        [
          91.881417778754,
          25.66329910410138
        ],
        [
          91.8811184755591,
          25.66222065470046
        ],
        [
          91.88231568833866,
          25.66249026705069
        ],
        [
          91.88291429472844,
          25.66293962096774
        ],
        [
          91.88321359792333,
          25.66293962096774
        ],
        [
          91.88331336565496,
          25.66275987940092
        ],
        [
          91.88441081070287,
          25.66284975018433
        ],
        [
          91.88461034616614,
          25.66267000861751
        ],
        [
          91.88461034616614,
          25.66240039626728
        ],
        [
          91.88431104297125,
          25.66222065470046
        ],
        [
          91.88421127523962,
          25.66177130078341
        ],
        [
          91.88461034616614,
          25.66150168843318
        ],
        [
          91.88461034616614,
          25.66123207608295
        ],
        [
          91.88490964936102,
          25.66114220529954
        ],
        [
          91.88500941709265,
          25.66087259294931
        ],
        [
          91.88530872028754,
          25.6607827221659
        ],
        [
          91.88510918482429,
          25.66060298059908
        ],
        [
          91.88510918482429,
          25.66024349746544
        ],
        [
          91.88540848801917,
          25.66006375589862
        ],
        [
          91.8855082557508,
          25.65970427276498
        ],
        [
          91.88580755894569,
          25.65961440198157
        ],
        [
          91.88580755894569,
          25.65934478963134
        ],
        [
          91.88520895255591,
          25.65889543571429
        ],
        [
          91.88520895255591,
          25.658176469447
        ],
        [
          91.88540848801917,
          25.65799672788019
        ],
        [
          91.88600709440895,
          25.65826634023042
        ],
        [
          91.88690500399362,
          25.658176469447
        ],
        [
          91.8872043071885,
          25.65844608179724
        ],
        [
          91.8872043071885,
          25.6589853064977
        ],
        [
          91.88640616533546,
          25.65952453119816
        ],
        [
          91.88640616533546,
          25.65979414354839
        ],
        [
          91.88700477172524,
          25.66024349746544
        ],
        [
          91.88690500399362,
          25.6607827221659
        ],
        [
          91.8865059330671,
          25.66087259294931
        ],
        [
          91.8865059330671,
          25.66132194686636
        ],
        [
          91.88690500399362,
          25.66159155921659
        ],
        [
          91.88700477172524,
          25.66240039626728
        ],
        [
          91.88660570079873,
          25.66267000861751
        ],
        [
          91.88610686214058,
          25.66267000861751
        ],
        [
          91.88590732667731,
          25.66249026705069
        ],
        [
          91.88530872028754,
          25.6625801378341
        ],
        [
          91.88520895255591,
          25.66338897488479
        ],
        [
          91.8848098816294,
          25.66365858723502
        ],
        [
          91.88471011389777,
          25.66419781193548
        ],
        [
          91.88590732667731,
          25.66419781193548
        ],
        [
          91.88590732667731,
          25.66437755350231
        ],
        [
          91.88500941709265,
          25.66509651976959
        ],
        [
          91.88500941709265,
          25.66527626133641
        ],
        [
          91.88441081070287,
          25.66527626133641
        ],
        [
          91.88441081070287,
          25.6660850983871
        ],
        [
          91.88461034616614,
          25.6660850983871
        ],
        [
          91.8848098816294,
          25.66572561525346
        ],
        [
          91.88500941709265,
          25.66572561525346
        ],
        [
          91.88520895255591,
          25.66599522760369
        ],
        [
          91.88580755894569,
          25.66572561525346
        ],
        [
          91.88590732667731,
          25.66680406465438
        ],
        [
          91.88670546853035,
          25.66653445230415
        ],
        [
          91.88680523626198,
          25.66707367700461
        ],
        [
          91.88700477172524,
          25.66725341857143
        ],
        [
          91.88770314584664,
          25.66725341857143
        ],
        [
          91.88790268130991,
          25.66770277248848
        ],
        [
          91.88780291357827,
          25.66860148032258
        ],
        [
          91.88810221677316,
          25.66869135110599
        ],
        [
          91.88800244904154,
          25.66887109267281
        ],
        [
          91.88900012635783,
          25.66905083423963
        ],
        [
          91.88939919728435,
          25.66860148032258
        ],
        [
          91.88979826821087,
          25.66851160953917
        ],
        [
          91.89019733913739,
          25.66815212640553
        ],
        [
          91.89019733913739,
          25.66779264327189
        ],
        [
          91.88979826821087,
          25.66752303092166
        ],
        [
          91.88979826821087,
          25.66716354778802
        ],
        [
          91.89009757140575,
          25.6669838062212
        ],
        [
          91.89009757140575,
          25.66635471073733
        ],
        [
          91.88969850047924,
          25.6660850983871
        ],
        [
          91.88949896501597,
          25.66527626133641
        ],
        [
          91.88919966182108,
          25.66500664898618
        ],
        [
          91.88900012635783,
          25.66392819958525
        ],
        [
          91.88929942955272,
          25.66383832880184
        ],
        [
          91.8895987327476,
          25.66419781193548
        ],
        [
          91.8898980359425,
          25.66491677820277
        ],
        [
          91.89029710686901,
          25.66536613211982
        ],
        [
          91.89029710686901,
          25.66581548603687
        ],
        [
          91.89119501645368,
          25.66653445230415
        ],
        [
          91.8915940873802,
          25.66635471073733
        ],
        [
          91.8915940873802,
          25.66617496917051
        ],
        [
          91.89179362284345,
          25.6660850983871
        ],
        [
          91.89179362284345,
          25.66491677820277
        ],
        [
          91.8912947841853,
          25.66455729506912
        ],
        [
          91.89149431964856,
          25.66374845801843
        ],
        [
          91.89079594552716,
          25.66311936253456
        ],
        [
          91.89049664233227,
          25.66222065470046
        ],
        [
          91.88979826821087,
          25.66168143
        ],
        [
          91.88979826821087,
          25.66132194686636
        ],
        [
          91.89009757140575,
          25.66114220529954
        ],
        [
          91.88999780367412,
          25.66060298059908
        ],
        [
          91.89039687460064,
          25.66051310981567
        ],
        [
          91.89049664233227,
          25.66024349746544
        ],
        [
          91.89079594552716,
          25.66024349746544
        ],
        [
          91.89089571325879,
          25.66087259294931
        ],
        [
          91.89049664233227,
          25.66114220529954
        ],
        [
          91.89059641006389,
          25.66186117156682
        ],
        [
          91.89099548099041,
          25.66222065470046
        ],
        [
          91.89179362284345,
          25.66240039626728
        ],
        [
          91.8919931583067,
          25.6625801378341
        ],
        [
          91.8919931583067,
          25.66401807036866
        ],
        [
          91.89249199696486,
          25.66428768271889
        ],
        [
          91.89259176469649,
          25.66491677820277
        ],
        [
          91.89309060335464,
          25.66500664898618
        ],
        [
          91.89329013881789,
          25.66599522760369
        ],
        [
          91.89289106789137,
          25.66653445230415
        ],
        [
          91.89209292603834,
          25.66635471073733
        ],
        [
          91.89169385511182,
          25.66716354778802
        ],
        [
          91.89119501645368,
          25.66707367700461
        ],
        [
          91.89039687460064,
          25.66779264327189
        ],
        [
          91.8895987327476,
          25.6696799297235
        ],
        [
          91.88969850047924,
          25.67066850834101
        ],
        [
          91.88949896501597,
          25.67075837912443
        ],
        [
          91.88949896501597,
          25.67120773304147
        ],
        [
          91.88979826821087,
          25.67129760382489
        ],
        [
          91.88999780367412,
          25.67102799147466
        ],
        [
          91.89099548099041,
          25.67102799147466
        ],
        [
          91.89139455191693,
          25.67084824990783
        ],
        [
          91.89149431964856,
          25.67147734539171
        ],
        [
          91.8912947841853,
          25.67156721617512
        ],
        [
          91.8912947841853,
          25.67210644087558
        ],
        [
          91.89169385511182,
          25.6722861824424
        ],
        [
          91.89169385511182,
          25.67255579479263
        ],
        [
          91.89209292603834,
          25.67282540714286
        ],
        [
          91.89209292603834,
          25.67309501949309
        ],
        [
          91.89279130015974,
          25.67327476105991
        ],
        [
          91.89299083562301,
          25.67372411497696
        ],
        [
          91.89358944201278,
          25.67381398576037
        ],
        [
          91.89358944201278,
          25.67435321046083
        ],
        [
          91.89378897747604,
          25.67453295202765
        ],
        [
          91.89418804840255,
          25.67453295202765
        ],
        [
          91.89438758386582,
          25.67426333967742
        ],
        [
          91.89458711932907,
          25.67426333967742
        ],
        [
          91.89478665479233,
          25.67489243516129
        ],
        [
          91.89558479664537,
          25.6749823059447
        ],
        [
          91.89608363530351,
          25.67561140142857
        ],
        [
          91.89628317076678,
          25.67561140142857
        ],
        [
          91.89608363530351,
          25.67399372732719
        ],
        [
          91.89628317076678,
          25.67363424419355
        ],
        [
          91.89658247396166,
          25.67363424419355
        ],
        [
          91.89688177715655,
          25.67336463184332
        ],
        [
          91.89688177715655,
          25.67273553635945
        ],
        [
          91.89787945447284,
          25.67273553635945
        ],
        [
          91.89827852539936,
          25.67309501949309
        ],
        [
          91.89857782859426,
          25.6740835981106
        ],
        [
          91.89937597044728,
          25.67390385654378
        ],
        [
          91.89997457683707,
          25.67327476105991
        ],
        [
          91.90087248642173,
          25.67327476105991
        ],
        [
          91.90087248642173,
          25.67309501949309
        ],
        [
          91.90107202188499,
          25.67309501949309
        ],
        [
          91.9014710928115,
          25.67246592400922
        ],
        [
          91.90196993146965,
          25.67210644087558
        ],
        [
          91.90196993146965,
          25.67183682852535
        ],
        [
          91.9024687701278,
          25.67147734539171
        ],
        [
          91.9024687701278,
          25.67129760382489
        ],
        [
          91.90336667971246,
          25.67093812069124
        ],
        [
          91.90346644744409,
          25.67066850834101
        ],
        [
          91.90276807332269,
          25.67048876677419
        ],
        [
          91.9024687701278,
          25.67084824990783
        ],
        [
          91.90187016373802,
          25.67084824990783
        ],
        [
          91.90157086054313,
          25.67120773304147
        ],
        [
          91.90117178961661,
          25.67120773304147
        ],
        [
          91.90087248642173,
          25.67093812069124
        ],
        [
          91.90087248642173,
          25.6705786375576
        ],
        [
          91.90117178961661,
          25.67048876677419
        ],
        [
          91.90117178961661,
          25.67030902520737
        ],
        [
          91.90067295095847,
          25.66994954207373
        ],
        [
          91.90027388003195,
          25.66994954207373
        ],
        [
          91.90017411230032,
          25.6696799297235
        ],
        [
          91.90017411230032,
          25.66887109267281
        ],
        [
          91.90037364776357,
          25.66851160953917
        ],
        [
          91.90077271869009,
          25.66833186797235
        ],
        [
          91.90087248642173,
          25.6678825140553
        ],
        [
          91.9000743445687,
          25.66797238483871
        ],
        [
          91.89997457683707,
          25.66842173875576
        ],
        [
          91.89967527364217,
          25.66860148032258
        ],
        [
          91.89957550591055,
          25.66842173875576
        ],
        [
          91.89937597044728,
          25.66842173875576
        ],
        [
          91.89937597044728,
          25.66806225562212
        ],
        [
          91.89867759632588,
          25.66797238483871
        ],
        [
          91.89847806086262,
          25.66770277248848
        ],
        [
          91.89797922220447,
          25.66761290170507
        ],
        [
          91.89748038354632,
          25.66716354778802
        ],
        [
          91.89748038354632,
          25.66572561525346
        ],
        [
          91.89678200942492,
          25.665186390553
        ],
        [
          91.89678200942492,
          25.66419781193548
        ],
        [
          91.89618340303514,
          25.66401807036866
        ],
        [
          91.89618340303514,
          25.66365858723502
        ],
        [
          91.89578433210863,
          25.6634788456682
        ],
        [
          91.89578433210863,
          25.66311936253456
        ],
        [
          91.89548502891374,
          25.66293962096774
        ],
        [
          91.89558479664537,
          25.66240039626728
        ],
        [
          91.89538526118211,
          25.66231052548387
        ],
        [
          91.89538526118211,
          25.66195104235023
        ],
        [
          91.89508595798722,
          25.66177130078341
        ],
        [
          91.89508595798722,
          25.66141181764977
        ],
        [
          91.89488642252397,
          25.66141181764977
        ],
        [
          91.89448735159745,
          25.66105233451613
        ],
        [
          91.89438758386582,
          25.66060298059908
        ],
        [
          91.89378897747604,
          25.65997388511521
        ],
        [
          91.89368920974441,
          25.65934478963134
        ],
        [
          91.89329013881789,
          25.65907517728111
        ],
        [
          91.89329013881789,
          25.65835621101382
        ],
        [
          91.89259176469649,
          25.65808659866359
        ],
        [
          91.89259176469649,
          25.65718789082949
        ],
        [
          91.89279130015974,
          25.65718789082949
        ],
        [
          91.89309060335464,
          25.65754737396313
        ],
        [
          91.89368920974441,
          25.65745750317972
        ],
        [
          91.89378897747604,
          25.65763724474654
        ],
        [
          91.8939885129393,
          25.65763724474654
        ],
        [
          91.89388874520768,
          25.65718789082949
        ],
        [
          91.89338990654952,
          25.65664866612903
        ],
        [
          91.89338990654952,
          25.65601957064516
        ],
        [
          91.89408828067093,
          25.65574995829493
        ],
        [
          91.89458711932907,
          25.65583982907834
        ],
        [
          91.8946868870607,
          25.65619931221198
        ],
        [
          91.89488642252397,
          25.65619931221198
        ],
        [
          91.89508595798722,
          25.65655879534562
        ],
        [
          91.89558479664537,
          25.65664866612903
        ],
        [
          91.89618340303514,
          25.65736763239631
        ],
        [
          91.89678200942492,
          25.65772711552995
        ],
        [
          91.89698154488818,
          25.65844608179724
        ],
        [
          91.89827852539936,
          25.65943466041475
        ],
        [
          91.89867759632588,
          25.66033336824885
        ],
        [
          91.89947573817892,
          25.66105233451613
        ],
        [
          91.89997457683707,
          25.66105233451613
        ],
        [
          91.90027388003195,
          25.66141181764977
        ],
        [
          91.90047341549521,
          25.66141181764977
        ],
        [
          91.9000743445687,
          25.6607827221659
        ],
        [
          91.9000743445687,
          25.66033336824885
        ],
        [
          91.90057318322684,
          25.66015362668203
        ],
        [
          91.90057318322684,
          25.65970427276498
        ],
        [
          91.90027388003195,
          25.65952453119816
        ],
        [
          91.9000743445687,
          25.65871569414747
        ],
        [
          91.89967527364217,
          25.6589853064977
        ],
        [
          91.89917643498403,
          25.65889543571429
        ],
        [
          91.89917643498403,
          25.65862582336405
        ],
        [
          91.89897689952076,
          25.65871569414747
        ],
        [
          91.89887713178913,
          25.65826634023042
        ],
        [
          91.89837829313099,
          25.65799672788019
        ],
        [
          91.89837829313099,
          25.65772711552995
        ],
        [
          91.89807898993611,
          25.65754737396313
        ],
        [
          91.89787945447284,
          25.65691827847926
        ],
        [
          91.89758015127795,
          25.65673853691244
        ],
        [
          91.89758015127795,
          25.6563790537788
        ],
        [
          91.8970813126198,
          25.65601957064516
        ],
        [
          91.89698154488818,
          25.6554803459447
        ],
        [
          91.8966822416933,
          25.65539047516129
        ],
        [
          91.8966822416933,
          25.65494112124424
        ],
        [
          91.89688177715655,
          25.65485125046083
        ],
        [
          91.89688177715655,
          25.65386267184332
        ],
        [
          91.89598386757189,
          25.65314370557604
        ],
        [
          91.89538526118211,
          25.65314370557604
        ],
        [
          91.89508595798722,
          25.65296396400922
        ],
        [
          91.89378897747604,
          25.65314370557604
        ],
        [
          91.89209292603834,
          25.6527842224424
        ],
        [
          91.89179362284345,
          25.65251461009217
        ],
        [
          91.8915940873802,
          25.6519753853917
        ],
        [
          91.89119501645368,
          25.65170577304147
        ],
        [
          91.89119501645368,
          25.65134628990783
        ],
        [
          91.89079594552716,
          25.65125641912442
        ],
        [
          91.89029710686901,
          25.65044758207373
        ],
        [
          91.89029710686901,
          25.65008809894009
        ],
        [
          91.89049664233227,
          25.64981848658986
        ],
        [
          91.89039687460064,
          25.64865016640553
        ],
        [
          91.88969850047924,
          25.64811094170507
        ],
        [
          91.8895987327476,
          25.64784132935484
        ],
        [
          91.88929942955272,
          25.64775145857143
        ],
        [
          91.88900012635783,
          25.64685275073733
        ],
        [
          91.88850128769968,
          25.64649326760369
        ],
        [
          91.88840151996806,
          25.64604391368664
        ],
        [
          91.88790268130991,
          25.645684430553
        ],
        [
          91.88780291357827,
          25.64523507663595
        ],
        [
          91.88690500399362,
          25.64451611036866
        ],
        [
          91.8865059330671,
          25.64343766096774
        ],
        [
          91.88610686214058,
          25.64316804861751
        ],
        [
          91.88610686214058,
          25.64280856548387
        ],
        [
          91.88580755894569,
          25.64262882391705
        ],
        [
          91.88600709440895,
          25.64137063294931
        ],
        [
          91.88560802348243,
          25.64137063294931
        ],
        [
          91.88540848801917,
          25.64173011608295
        ],
        [
          91.88401173977635,
          25.64173011608295
        ],
        [
          91.88281452699681,
          25.64119089138249
        ],
        [
          91.88271475926518,
          25.64074153746544
        ],
        [
          91.88181684968052,
          25.64083140824885
        ],
        [
          91.881417778754,
          25.64056179589862
        ],
        [
          91.881417778754,
          25.6403820543318
        ],
        [
          91.8804201014377,
          25.64011244198157
        ],
        [
          91.88022056597444,
          25.63993270041475
        ],
        [
          91.88012079824281,
          25.63948334649769
        ],
        [
          91.87962195958467,
          25.63993270041475
        ],
        [
          91.87862428226838,
          25.63993270041475
        ],
        [
          91.8780256758786,
          25.63948334649769
        ],
        [
          91.87742706948882,
          25.63930360493088
        ],
        [
          91.87722753402556,
          25.63894412179723
        ],
        [
          91.87692823083067,
          25.63921373414746
        ],
        [
          91.87652915990415,
          25.63921373414746
        ],
        [
          91.876030321246,
          25.63912386336406
        ],
        [
          91.87563125031949,
          25.63876438023041
        ],
        [
          91.87553148258786,
          25.63894412179723
        ],
        [
          91.87443403753994,
          25.63921373414746
        ],
        [
          91.87433426980832,
          25.63957321728111
        ],
        [
          91.87403496661342,
          25.63984282963134
        ],
        [
          91.87353612795528,
          25.63984282963134
        ]
      ],
      [
        [
          91.88670546853035,
          25.6563790537788
        ],
        [
          91.88590732667731,
          25.65619931221198
        ],
        [
          91.88590732667731,
          25.65574995829493
        ],
        [
          91.8862066298722,
          25.6554803459447
        ],
        [
          91.88670546853035,
          25.65566008751152
        ],
        [
          91.88690500399362,
          25.65619931221198
        ],
        [
          91.88690500399362,
          25.6563790537788
        ],
        [
          91.88670546853035,
          25.6563790537788
        ]
      ],
      [
        [
          91.87104193466455,
          25.6403820543318
        ],
        [
          91.8712414701278,
          25.6403820543318
        ],
        [
          91.8712414701278,
          25.64065166668203
        ],
        [
          91.87084239920128,
          25.64056179589862
        ],
        [
          91.87084239920128,
          25.64029218354839
        ],
        [
          91.87104193466455,
          25.6403820543318
        ]
      ]
    ],
    [
      [
        [
          91.88032033370607,
          25.65125641912442
        ],
        [
          91.88022056597444,
          25.65098680677419
        ],
        [
          91.88012079824281,
          25.65116654834101
        ],
        [
          91.88032033370607,
          25.65125641912442
        ]
      ]
    ],
    [
      [
        [
          91.87373566341853,
          25.63193420069124
        ],
        [
          91.87403496661342,
          25.63175445912442
        ],
        [
          91.87413473434505,
          25.63076588050691
        ],
        [
          91.87383543115017,
          25.63130510520737
        ],
        [
          91.87373566341853,
          25.63193420069124
        ]
      ]
    ],
    [
      [
        [
          91.87303728929713,
          25.63283290852534
        ],
        [
          91.87313705702876,
          25.63265316695853
        ],
        [
          91.8729375215655,
          25.63256329617511
        ],
        [
          91.87283775383386,
          25.63274303774194
        ],
        [
          91.87303728929713,
          25.63283290852534
        ]
      ]
    ],
    [
      [
        [
          91.87233891517572,
          25.63265316695853
        ],
        [
          91.87263821837061,
          25.63256329617511
        ],
        [
          91.87243868290736,
          25.63238355460829
        ],
        [
          91.87203961198084,
          25.63238355460829
        ],
        [
          91.87233891517572,
          25.63265316695853
        ]
      ]
    ],
    [
      [
        [
          91.87054309600639,
          25.6315747175576
        ],
        [
          91.87074263146965,
          25.6315747175576
        ],
        [
          91.87064286373803,
          25.63130510520737
        ],
        [
          91.87044332827476,
          25.63130510520737
        ],
        [
          91.87054309600639,
          25.6315747175576
        ]
      ]
    ],
    [
      [
        [
          91.87024379281151,
          25.63112536364055
        ],
        [
          91.87044332827476,
          25.63094562207373
        ],
        [
          91.87004425734824,
          25.63076588050691
        ],
        [
          91.87024379281151,
          25.63112536364055
        ]
      ]
    ],
    [
      [
        [
          91.8695454186901,
          25.63040639737327
        ],
        [
          91.86974495415336,
          25.63040639737327
        ],
        [
          91.86974495415336,
          25.63022665580645
        ],
        [
          91.8695454186901,
          25.63022665580645
        ],
        [
          91.8695454186901,
          25.63040639737327
        ]
      ]
    ],
    [
      [
        [
          91.86974495415336,
          25.63040639737327
        ],
        [
          91.86974495415336,
          25.63058613894009
        ],
        [
          91.86994448961661,
          25.63058613894009
        ],
        [
          91.86974495415336,
          25.63040639737327
        ]
      ]
    ],
    [
      [
        [
          91.8688470445687,
          25.62905833562212
        ],
        [
          91.86904658003195,
          25.62959756032258
        ],
        [
          91.86904658003195,
          25.62914820640553
        ],
        [
          91.8688470445687,
          25.62905833562212
        ]
      ]
    ],
    [
      [
        [
          91.86086562603835,
          25.62959756032258
        ],
        [
          91.86246190974441,
          25.62986717267281
        ],
        [
          91.86535517396166,
          25.6297773018894
        ],
        [
          91.8658540126198,
          25.62941781875576
        ],
        [
          91.8661533158147,
          25.6288785940553
        ],
        [
          91.8661533158147,
          25.62851911092166
        ],
        [
          91.86635285127795,
          25.62833936935484
        ],
        [
          91.86605354808307,
          25.62842924013825
        ],
        [
          91.86595378035145,
          25.6288785940553
        ],
        [
          91.8654549416933,
          25.62932794797235
        ],
        [
          91.86316028386582,
          25.62923807718894
        ],
        [
          91.86256167747604,
          25.62932794797235
        ],
        [
          91.86256167747604,
          25.62959756032258
        ],
        [
          91.86086562603835,
          25.62959756032258
        ]
      ]
    ],
    [
      [
        [
          91.8586707359425,
          25.63031652658986
        ],
        [
          91.85897003913739,
          25.63013678502304
        ],
        [
          91.8586707359425,
          25.63013678502304
        ],
        [
          91.8586707359425,
          25.63031652658986
        ]
      ]
    ],
    [
      [
        [
          91.85787259408946,
          25.63489993654378
        ],
        [
          91.85807212955272,
          25.63489993654378
        ],
        [
          91.85817189728435,
          25.63472019497696
        ],
        [
          91.8576730586262,
          25.63463032419355
        ],
        [
          91.85787259408946,
          25.63489993654378
        ]
      ]
    ],
    [
      [
        [
          91.85727398769968,
          25.63058613894009
        ],
        [
          91.85797236182108,
          25.63049626815668
        ],
        [
          91.85807212955272,
          25.63031652658986
        ],
        [
          91.8576730586262,
          25.63031652658986
        ],
        [
          91.85727398769968,
          25.63058613894009
        ]
      ]
    ],
    [
      [
        [
          91.85667538130991,
          25.63364174557604
        ],
        [
          91.85667538130991,
          25.63382148714286
        ],
        [
          91.85747352316294,
          25.63445058262673
        ],
        [
          91.85747352316294,
          25.63427084105991
        ],
        [
          91.85667538130991,
          25.63364174557604
        ]
      ]
    ],
    [
      [
        [
          91.85617654265177,
          25.63265316695853
        ],
        [
          91.85647584584665,
          25.63319239165899
        ],
        [
          91.85647584584665,
          25.63283290852534
        ],
        [
          91.85637607811502,
          25.63265316695853
        ],
        [
          91.85617654265177,
          25.63265316695853
        ]
      ]
    ]
  ],
  "type": "MultiPolygon"
}