
selvaria.png
size: 1024,256
format: RGBA8888
filter: Linear,Linear
repeat: none
01
  rotate: true
  xy: 2, 38
  size: 216, 308
  orig: 216, 308
  offset: 0, 0
  index: -1
1
  rotate: true
  xy: 312, 50
  size: 204, 298
  orig: 204, 298
  offset: 0, 0
  index: -1
11
  rotate: true
  xy: 612, 40
  size: 65, 101
  orig: 65, 101
  offset: 0, 0
  index: -1
1111
  rotate: true
  xy: 262, 2
  size: 34, 32
  orig: 34, 32
  offset: 0, 0
  index: -1
1113
  rotate: true
  xy: 882, 118
  size: 36, 41
  orig: 36, 41
  offset: 0, 0
  index: -1
1114
  rotate: false
  xy: 346, 5
  size: 33, 31
  orig: 33, 31
  offset: 0, 0
  index: -1
19
  rotate: true
  xy: 766, 218
  size: 36, 201
  orig: 36, 201
  offset: 0, 0
  index: -1
20
  rotate: true
  xy: 932, 157
  size: 29, 16
  orig: 29, 16
  offset: 0, 0
  index: -1
21
  rotate: true
  xy: 952, 191
  size: 25, 15
  orig: 25, 15
  offset: 0, 0
  index: -1
22
  rotate: false
  xy: 715, 44
  size: 20, 8
  orig: 20, 8
  offset: 0, 0
  index: -1
221
  rotate: false
  xy: 385, 40
  size: 13, 8
  orig: 13, 8
  offset: 0, 0
  index: -1
2221
  rotate: false
  xy: 969, 221
  size: 47, 33
  orig: 47, 33
  offset: 0, 0
  index: -1
2223
  rotate: true
  xy: 715, 54
  size: 51, 44
  orig: 51, 44
  offset: 0, 0
  index: -1
2224
  rotate: false
  xy: 836, 118
  size: 44, 31
  orig: 44, 31
  offset: 0, 0
  index: -1
23
  rotate: false
  xy: 612, 107
  size: 152, 147
  orig: 152, 147
  offset: 0, 0
  index: -1
26
  rotate: true
  xy: 158, 2
  size: 34, 50
  orig: 34, 50
  offset: 0, 0
  index: -1
27
  rotate: true
  xy: 296, 6
  size: 30, 48
  orig: 30, 48
  offset: 0, 0
  index: -1
30
  rotate: true
  xy: 766, 151
  size: 65, 114
  orig: 65, 114
  offset: 0, 0
  index: -1
31
  rotate: true
  xy: 210, 2
  size: 34, 50
  orig: 34, 50
  offset: 0, 0
  index: -1
32
  rotate: true
  xy: 882, 156
  size: 30, 48
  orig: 30, 48
  offset: 0, 0
  index: -1
34
  rotate: true
  xy: 766, 121
  size: 28, 68
  orig: 28, 68
  offset: 0, 0
  index: -1
35
  rotate: true
  xy: 2, 2
  size: 34, 80
  orig: 34, 80
  offset: 0, 0
  index: -1
37
  rotate: true
  xy: 882, 188
  size: 28, 68
  orig: 28, 68
  offset: 0, 0
  index: -1
38
  rotate: true
  xy: 84, 2
  size: 34, 72
  orig: 34, 72
  offset: 0, 0
  index: -1
5
  rotate: false
  xy: 312, 38
  size: 71, 10
  orig: 71, 10
  offset: 0, 0
  index: -1
