
kojyo.png
size: 512,256
format: RGBA8888
filter: Linear,Linear
repeat: none
02
  rotate: false
  xy: 2, 92
  size: 182, 156
  orig: 182, 156
  offset: 0, 0
  index: -1
03
  rotate: true
  xy: 2, 2
  size: 88, 158
  orig: 88, 158
  offset: 0, 0
  index: -1
11
  rotate: false
  xy: 340, 104
  size: 56, 28
  orig: 56, 28
  offset: 0, 0
  index: -1
1111
  rotate: true
  xy: 448, 78
  size: 34, 32
  orig: 34, 32
  offset: 0, 0
  index: -1
1113
  rotate: false
  xy: 303, 58
  size: 36, 41
  orig: 36, 41
  offset: 0, 0
  index: -1
1114
  rotate: false
  xy: 347, 36
  size: 33, 31
  orig: 33, 31
  offset: 0, 0
  index: -1
14
  rotate: false
  xy: 407, 162
  size: 73, 86
  orig: 73, 86
  offset: 0, 0
  index: -1
20
  rotate: true
  xy: 482, 79
  size: 29, 16
  orig: 29, 16
  offset: 0, 0
  index: -1
21
  rotate: false
  xy: 250, 16
  size: 25, 15
  orig: 25, 15
  offset: 0, 0
  index: -1
22
  rotate: false
  xy: 186, 97
  size: 10, 2
  orig: 10, 2
  offset: 0, 0
  index: -1
221
  rotate: false
  xy: 347, 26
  size: 13, 8
  orig: 13, 8
  offset: 0, 0
  index: -1
2221
  rotate: false
  xy: 341, 69
  size: 47, 33
  orig: 47, 33
  offset: 0, 0
  index: -1
2223
  rotate: false
  xy: 198, 55
  size: 51, 44
  orig: 51, 44
  offset: 0, 0
  index: -1
2224
  rotate: false
  xy: 301, 25
  size: 44, 31
  orig: 44, 31
  offset: 0, 0
  index: -1
23
  rotate: false
  xy: 186, 101
  size: 152, 147
  orig: 152, 147
  offset: 0, 0
  index: -1
26
  rotate: true
  xy: 198, 19
  size: 34, 50
  orig: 34, 50
  offset: 0, 0
  index: -1
27
  rotate: true
  xy: 398, 82
  size: 30, 48
  orig: 30, 48
  offset: 0, 0
  index: -1
30
  rotate: false
  xy: 340, 134
  size: 65, 114
  orig: 65, 114
  offset: 0, 0
  index: -1
31
  rotate: true
  xy: 251, 65
  size: 34, 50
  orig: 34, 50
  offset: 0, 0
  index: -1
32
  rotate: true
  xy: 251, 33
  size: 30, 48
  orig: 30, 48
  offset: 0, 0
  index: -1
34
  rotate: false
  xy: 482, 180
  size: 28, 68
  orig: 28, 68
  offset: 0, 0
  index: -1
35
  rotate: false
  xy: 162, 10
  size: 34, 80
  orig: 34, 80
  offset: 0, 0
  index: -1
37
  rotate: false
  xy: 482, 110
  size: 28, 68
  orig: 28, 68
  offset: 0, 0
  index: -1
38
  rotate: true
  xy: 407, 126
  size: 34, 72
  orig: 34, 72
  offset: 0, 0
  index: -1
5
  rotate: false
  xy: 398, 114
  size: 71, 10
  orig: 71, 10
  offset: 0, 0
  index: -1
