
taiga.png
size: 512,512
format: RGBA8888
filter: Linear,Linear
repeat: none
1
  rotate: false
  xy: 2, 27
  size: 185, 169
  orig: 185, 169
  offset: 0, 0
  index: -1
10
  rotate: false
  xy: 415, 147
  size: 30, 48
  orig: 30, 48
  offset: 0, 0
  index: -1
1113
  rotate: false
  xy: 314, 56
  size: 36, 41
  orig: 36, 41
  offset: 0, 0
  index: -1
1114
  rotate: true
  xy: 352, 66
  size: 33, 31
  orig: 33, 31
  offset: 0, 0
  index: -1
12
  rotate: false
  xy: 189, 72
  size: 87, 124
  orig: 87, 124
  offset: 0, 0
  index: -1
14
  rotate: false
  xy: 314, 99
  size: 34, 50
  orig: 34, 50
  offset: 0, 0
  index: -1
15
  rotate: false
  xy: 350, 101
  size: 30, 48
  orig: 30, 48
  offset: 0, 0
  index: -1
16
  rotate: false
  xy: 455, 360
  size: 28, 68
  orig: 28, 68
  offset: 0, 0
  index: -1
17
  rotate: false
  xy: 455, 430
  size: 34, 80
  orig: 34, 80
  offset: 0, 0
  index: -1
18
  rotate: false
  xy: 278, 127
  size: 28, 68
  orig: 28, 68
  offset: 0, 0
  index: -1
19
  rotate: true
  xy: 189, 36
  size: 34, 72
  orig: 34, 72
  offset: 0, 0
  index: -1
2
  rotate: false
  xy: 2, 12
  size: 58, 13
  orig: 58, 13
  offset: 0, 0
  index: -1
20
  rotate: false
  xy: 2, 198
  size: 287, 312
  orig: 287, 312
  offset: 0, 0
  index: -1
21
  rotate: false
  xy: 291, 346
  size: 162, 164
  orig: 162, 164
  offset: 0, 0
  index: -1
22
  rotate: false
  xy: 308, 146
  size: 4, 3
  orig: 4, 3
  offset: 0, 0
  index: -1
221
  rotate: false
  xy: 2, 2
  size: 13, 8
  orig: 13, 8
  offset: 0, 0
  index: -1
2223
  rotate: false
  xy: 308, 151
  size: 51, 44
  orig: 51, 44
  offset: 0, 0
  index: -1
2224
  rotate: true
  xy: 382, 107
  size: 44, 31
  orig: 44, 31
  offset: 0, 0
  index: -1
3
  rotate: false
  xy: 361, 153
  size: 52, 42
  orig: 52, 42
  offset: 0, 0
  index: -1
4
  rotate: false
  xy: 415, 104
  size: 35, 41
  orig: 35, 41
  offset: 0, 0
  index: -1
5
  rotate: true
  xy: 491, 481
  size: 29, 16
  orig: 29, 16
  offset: 0, 0
  index: -1
6
  rotate: true
  xy: 491, 454
  size: 25, 15
  orig: 25, 15
  offset: 0, 0
  index: -1
7
  rotate: false
  xy: 189, 28
  size: 10, 6
  orig: 10, 6
  offset: 0, 0
  index: -1
8
  rotate: false
  xy: 291, 197
  size: 152, 147
  orig: 152, 147
  offset: 0, 0
  index: -1
9
  rotate: false
  xy: 278, 75
  size: 34, 50
  orig: 34, 50
  offset: 0, 0
  index: -1
