<?xml version="1.0" encoding="utf-8"?>
<!-- Generated by IcoMoon.io -->
<!DOCTYPE svg PUBLIC "-//W3C//DTD SVG 1.1//EN" "http://www.w3.org/Graphics/SVG/1.1/DTD/svg11.dtd">
<svg version="1.1" xmlns="http://www.w3.org/2000/svg" xmlns:xlink="http://www.w3.org/1999/xlink" width="16" height="16" viewBox="0 0 16 16">
<path d="M1 12h4v4h-4v-4z"></path>
<path d="M6 12h4v4h-4v-4z"></path>
<path d="M11 12h4v4h-4v-4z"></path>
<path d="M1 7h4v4h-4v-4z"></path>
<path d="M1 2h4v4h-4v-4z"></path>
<path d="M6 7h4v4h-4v-4z"></path>
<path d="M7 1h4v4h-4v-4z"></path>
<path d="M11 7h4v4h-4v-4z"></path>
<path d="M13 0h3v3h-3v-3z"></path>
</svg>
