<?xml version="1.0" encoding="utf-8"?>
<!-- Generated by IcoMoon.io -->
<!DOCTYPE svg PUBLIC "-//W3C//DTD SVG 1.1//EN" "http://www.w3.org/Graphics/SVG/1.1/DTD/svg11.dtd">
<svg version="1.1" xmlns="http://www.w3.org/2000/svg" xmlns:xlink="http://www.w3.org/1999/xlink" width="16" height="16" viewBox="0 0 16 16">
<path d="M16 3c-0.6 0.3-1.2 0.4-1.9 0.5 0.7-0.4 1.2-1 1.4-1.8-0.6 0.4-1.3 0.6-2.1 0.8-0.6-0.6-1.5-1-2.4-1-1.7 0-3.2 1.5-3.2 3.3 0 0.3 0 0.5 0.1 0.7-2.7-0.1-5.2-1.4-6.8-3.4-0.3 0.5-0.4 1-0.4 1.7 0 1.1 0.6 2.1 1.5 2.7-0.5 0-1-0.2-1.5-0.4 0 0 0 0 0 0 0 1.6 1.1 2.9 2.6 3.2-0.3 0.1-0.6 0.1-0.9 0.1-0.2 0-0.4 0-0.6-0.1 0.4 1.3 1.6 2.3 3.1 2.3-1.1 0.9-2.5 1.4-4.1 1.4-0.3 0-0.5 0-0.8 0 1.5 0.9 3.2 1.5 5 1.5 6 0 9.3-5 9.3-9.3 0-0.1 0-0.3 0-0.4 0.7-0.5 1.3-1.1 1.7-1.8z"></path>
</svg>
