<?xml version="1.0" encoding="utf-8"?>
<!-- Generated by IcoMoon.io -->
<!DOCTYPE svg PUBLIC "-//W3C//DTD SVG 1.1//EN" "http://www.w3.org/Graphics/SVG/1.1/DTD/svg11.dtd">
<svg version="1.1" xmlns="http://www.w3.org/2000/svg" xmlns:xlink="http://www.w3.org/1999/xlink" width="16" height="16" viewBox="0 0 16 16">
<path d="M7.2 16v-7.5h-2v-2.7h2c0 0 0-1.1 0-2.3 0-1.8 1.2-3.5 3.9-3.5 1.1 0 1.9 0.1 1.9 0.1l-0.1 2.5c0 0-0.8 0-1.7 0-1 0-1.1 0.4-1.1 1.2 0 0.6 0-1.3 0 2h2.9l-0.1 2.7h-2.8v7.5h-2.9z"></path>
</svg>
