<?xml version="1.0" encoding="utf-8"?>
<!-- Generated by IcoMoon.io -->
<!DOCTYPE svg PUBLIC "-//W3C//DTD SVG 1.1//EN" "http://www.w3.org/Graphics/SVG/1.1/DTD/svg11.dtd">
<svg version="1.1" xmlns="http://www.w3.org/2000/svg" xmlns:xlink="http://www.w3.org/1999/xlink" width="16" height="16" viewBox="0 0 16 16">
<path d="M11 15h-2v-8l6-7h-15l6 7v8h-2c-2 0-2 1-2 1h11c0 0 0-1-2-1zM12.9 1l-1.8 2h-7.2l-1.7-2h10.7zM7 15v-8h1v8h-1z"></path>
</svg>
