<?xml version="1.0" encoding="utf-8"?>
<!-- Generated by IcoMoon.io -->
<!DOCTYPE svg PUBLIC "-//W3C//DTD SVG 1.1//EN" "http://www.w3.org/Graphics/SVG/1.1/DTD/svg11.dtd">
<svg version="1.1" xmlns="http://www.w3.org/2000/svg" xmlns:xlink="http://www.w3.org/1999/xlink" width="16" height="16" viewBox="0 0 16 16">
<path d="M2 12h1v1h-1v-1z"></path>
<path d="M4 12h3v1h-3v-1z"></path>
<path d="M13 1h-10l-3 9v5h16v-5l-3-9zM3.7 2h8.6l2.7 8h-13.9l2.6-8zM1 14v-3h14v3h-14z"></path>
</svg>
