<?xml version="1.0" encoding="utf-8"?>
<!-- Generated by IcoMoon.io -->
<!DOCTYPE svg PUBLIC "-//W3C//DTD SVG 1.1//EN" "http://www.w3.org/Graphics/SVG/1.1/DTD/svg11.dtd">
<svg version="1.1" xmlns="http://www.w3.org/2000/svg" xmlns:xlink="http://www.w3.org/1999/xlink" width="16" height="16" viewBox="0 0 16 16">
<path d="M8 0c0 0-5 8.2-5 11s2.2 5 5 5 5-2.2 5-5-5-11-5-11zM8.9 14.9l-0.2-1c1.4-0.3 2.4-1.7 2.4-3.2 0-0.3-0.1-1.1-0.8-2.6l0.9-0.4c0.6 1.4 0.8 2.4 0.8 3 0 2-1.3 3.8-3.1 4.2z"></path>
</svg>
