<?xml version="1.0" encoding="utf-8"?>
<!-- Generated by IcoMoon.io -->
<!DOCTYPE svg PUBLIC "-//W3C//DTD SVG 1.1//EN" "http://www.w3.org/Graphics/SVG/1.1/DTD/svg11.dtd">
<svg version="1.1" xmlns="http://www.w3.org/2000/svg" xmlns:xlink="http://www.w3.org/1999/xlink" width="16" height="16" viewBox="0 0 16 16">
<path d="M10 3h-1v-2h-2v2h-1l2 3 2-3z"></path>
<path d="M14 13l-1.58-1.18 0.78-1.82-2-0.23-0.2-1.97-1.82 0.78-1.18-1.58-1.18 1.58-1.82-0.78-0.23 2-1.97 0.2 0.78 1.82-1.58 1.18h-2v1h16v-1h-2zM4 13c0.075-2.178 1.822-3.925 3.993-4 2.185 0.075 3.932 1.821 4.007 3.993l-8 0.007z"></path>
</svg>
