<?xml version="1.0" encoding="utf-8"?>
<!-- Generated by IcoMoon.io -->
<!DOCTYPE svg PUBLIC "-//W3C//DTD SVG 1.1//EN" "http://www.w3.org/Graphics/SVG/1.1/DTD/svg11.dtd">
<svg version="1.1" xmlns="http://www.w3.org/2000/svg" xmlns:xlink="http://www.w3.org/1999/xlink" width="16" height="16" viewBox="0 0 16 16">
<path d="M8.2 6.8c-0.1 0-0.1-0.1-0.2-0.1v-3.1c1.2 0.1 2.2 0.6 2.2 0.6l0.9-1.8c-0.1 0-1.5-0.8-3.1-0.8v-1.6h-1v1.6c-0.8 0.2-1.4 0.5-2 0.9-0.6 0.6-1 1.4-1 2.3 0 0.7 0.2 2.3 3 3.6v3.9c-0.9-0.2-2-0.7-2.4-0.9l-1 1.7c0.2 0.1 1.8 1 3.4 1.2v1.7h1v-1.7c0 0 0 0 0 0 2.3-0.3 3.6-2.1 3.6-3.8 0-1.5-1-2.7-3.4-3.7zM7 6.2c-0.8-0.5-1-1-1-1.3 0-0.4 0.1-0.7 0.4-0.9 0.2-0.1 0.4-0.2 0.6-0.3v2.5zM8 12.3v-3.4c1.1 0.5 1.6 1.1 1.6 1.6 0 0.6-0.3 1.6-1.6 1.8z"></path>
</svg>
