<?xml version="1.0" encoding="utf-8"?>
<!-- Generated by IcoMoon.io -->
<!DOCTYPE svg PUBLIC "-//W3C//DTD SVG 1.1//EN" "http://www.w3.org/Graphics/SVG/1.1/DTD/svg11.dtd">
<svg version="1.1" xmlns="http://www.w3.org/2000/svg" xmlns:xlink="http://www.w3.org/1999/xlink" width="16" height="16" viewBox="0 0 16 16">
<path d="M11 3h-3.6c0 0-4.4-0.2-4.4 4.3 0 3.5 2 6.7 2 6.7s-0.4-7 2.3-7h3.7v3l5-5-5-5v3z"></path>
<path d="M14 9v6h-13v-13h9v-1h-10v15h15v-8z"></path>
</svg>
