<?xml version="1.0" encoding="utf-8"?>
<!-- Generated by IcoMoon.io -->
<!DOCTYPE svg PUBLIC "-//W3C//DTD SVG 1.1//EN" "http://www.w3.org/Graphics/SVG/1.1/DTD/svg11.dtd">
<svg version="1.1" xmlns="http://www.w3.org/2000/svg" xmlns:xlink="http://www.w3.org/1999/xlink" width="16" height="16" viewBox="0 0 16 16">
<path d="M16 6.6l-8-5.2-2 1.3v-1.7h-2v3l-4 2.6 1.9 2.7 0.1-0.1v5.8h5v-4h2v4h5v-5.8l0.1 0.1 1.9-2.7zM1.4 6.9l6.6-4.3 6.6 4.3-0.7 1-5.9-3.9-5.9 3.9-0.7-1zM13 14h-3v-4h-4v4h-3v-5.4l5-3.3 5 3.3v5.4z"></path>
</svg>
