<?xml version="1.0" encoding="utf-8"?>
<!-- Generated by IcoMoon.io -->
<!DOCTYPE svg PUBLIC "-//W3C//DTD SVG 1.1//EN" "http://www.w3.org/Graphics/SVG/1.1/DTD/svg11.dtd">
<svg version="1.1" xmlns="http://www.w3.org/2000/svg" xmlns:xlink="http://www.w3.org/1999/xlink" width="16" height="16" viewBox="0 0 16 16">
<path d="M14 6v-2h-7l-1-2h-4l-1 2h-1v11h14v-1h-13v-9h0.62l1-2h2.57l1.19 2h6.62v1h1z"></path>
<path d="M14 7h-2v2h-2v2h2v2h2v-2h2v-2h-2v-2z"></path>
</svg>
