<?xml version="1.0" encoding="utf-8"?>
<!-- Generated by IcoMoon.io -->
<!DOCTYPE svg PUBLIC "-//W3C//DTD SVG 1.1//EN" "http://www.w3.org/Graphics/SVG/1.1/DTD/svg11.dtd">
<svg version="1.1" xmlns="http://www.w3.org/2000/svg" xmlns:xlink="http://www.w3.org/1999/xlink" width="16" height="16" viewBox="0 0 16 16">
<path d="M5 11h3v5h-3v-5z"></path>
<path d="M1 14h3v2h-3v-2z"></path>
<path d="M13 12h3v4h-3v-4z"></path>
<path d="M9 9h3v7h-3v-7z"></path>
<path d="M16 0.070l-5.68 4.97-5.47-1.7-4.85 3.76v1.9l5.15-4 5.53 1.72 5.32-4.66v-1.99z"></path>
</svg>
