<?xml version="1.0" encoding="utf-8"?>
<!-- Generated by IcoMoon.io -->
<!DOCTYPE svg PUBLIC "-//W3C//DTD SVG 1.1//EN" "http://www.w3.org/Graphics/SVG/1.1/DTD/svg11.dtd">
<svg version="1.1" xmlns="http://www.w3.org/2000/svg" xmlns:xlink="http://www.w3.org/1999/xlink" width="16" height="16" viewBox="0 0 16 16">
<path d="M11.7 8c4.2-0.3 4.3-2.7 4.3-5h-3v-3h-10v3h-3c0 2.3 0.1 4.7 4.3 5 0.9 1.4 2.1 2 2.7 2v4c-3 0-3 2-3 2h8c0 0 0-2-3-2v-4c0.6 0 1.8-0.6 2.7-2zM13 4h2c-0.1 1.6-0.4 2.7-2.7 2.9 0.3-0.8 0.6-1.7 0.7-2.9zM1 4h2c0.1 1.2 0.4 2.1 0.7 2.9-2.2-0.2-2.6-1.3-2.7-2.9zM4.5 6.1c-0.5-1.7-0.5-3.1-0.5-3.1v-2h1v2c0 0 0 1.7 0.4 3.1 0.5 1.7 1.6 2.9 1.6 2.9s-1.8-0.2-2.5-2.9z"></path>
</svg>
