<?xml version="1.0" encoding="utf-8"?>
<!-- Generated by IcoMoon.io -->
<!DOCTYPE svg PUBLIC "-//W3C//DTD SVG 1.1//EN" "http://www.w3.org/Graphics/SVG/1.1/DTD/svg11.dtd">
<svg version="1.1" xmlns="http://www.w3.org/2000/svg" xmlns:xlink="http://www.w3.org/1999/xlink" width="16" height="16" viewBox="0 0 16 16">
<path d="M10 0v4h4z"></path>
<path d="M9 0h-7v16h12v-11h-5v-5zM12 12h-8v-1h8v1zM12 10h-8v-1h8v1zM12 7v1h-8v-1h8z"></path>
</svg>
