<?xml version="1.0" encoding="utf-8"?>
<!-- Generated by IcoMoon.io -->
<!DOCTYPE svg PUBLIC "-//W3C//DTD SVG 1.1//EN" "http://www.w3.org/Graphics/SVG/1.1/DTD/svg11.dtd">
<svg version="1.1" xmlns="http://www.w3.org/2000/svg" xmlns:xlink="http://www.w3.org/1999/xlink" width="16" height="16" viewBox="0 0 16 16">
<path d="M14.9 0.9c-1.1-1-2.5-1.3-3.1-0.4-0.7 1.1 0.5 1.7-0.3 2.5-0.5 0.6-2-0.8-2-0.8l-0.8-0.8-1.4 1.4c-0.6 0.7-2.1 1.5-2.6 1.1-0.7-0.6 0.1-1.8-0.5-2.6-0.7-1-2.1-0.8-3 0.3-1 1.1-1.4 2.4-0.5 3 1.1 0.7 1.9-0.3 2.7 0.5 0.4 0.4-0.2 1.7-0.5 2.1l-2.3 2.3 6.5 6.5 1.7-1.7c0.7-0.7 1.5-2 1.1-2.4-0.6-0.7-1.7 0.1-2.5-0.4-1-0.7-0.8-2 0.3-3s2.5-1.3 3.1-0.4c0.7 1.1-0.4 1.8 0.4 2.6 0.4 0.4 1.6-0.2 2-0.6l2.1-2.1-1.1-1.1c-0.6-0.6-1.9-2-1.4-2.5 0.6-0.7 1.7 0.2 2.5-0.4 0.9-0.8 0.6-2.1-0.4-3.1z"></path>
</svg>
