<?xml version="1.0" encoding="utf-8"?>
<!-- Generated by IcoMoon.io -->
<!DOCTYPE svg PUBLIC "-//W3C//DTD SVG 1.1//EN" "http://www.w3.org/Graphics/SVG/1.1/DTD/svg11.dtd">
<svg version="1.1" xmlns="http://www.w3.org/2000/svg" xmlns:xlink="http://www.w3.org/1999/xlink" width="16" height="16" viewBox="0 0 16 16">
<path d="M11 10l-2.9-3.2-3.3 3.2h2.2v1.8c0 1.7-0.9 4.2-4 4.2 4.8 0 6-1.4 6-4.3v-1.7h2z"></path>
<path d="M0 0v13h6v-1h-5v-9h14v9h-5v1h6v-13h-16zM2 2h-1v-1h1v1zM13 2h-10v-1h10v1z"></path>
</svg>
