<?xml version="1.0" encoding="utf-8"?>
<!-- Generated by IcoMoon.io -->
<!DOCTYPE svg PUBLIC "-//W3C//DTD SVG 1.1//EN" "http://www.w3.org/Graphics/SVG/1.1/DTD/svg11.dtd">
<svg version="1.1" xmlns="http://www.w3.org/2000/svg" xmlns:xlink="http://www.w3.org/1999/xlink" width="16" height="16" viewBox="0 0 16 16">
<path d="M12 15h-10v-14h6v4h4v2.59l1-1v-2.59l-4-4h-8v16h12v-2.59l-1-1v2.59zM9 1l3 3h-3v-3z"></path>
<path d="M15 8l-1-1-2 2-2-2-1 1 2 2-2 2 1 1 2-2 2 2 1-1-2-2 2-2z"></path>
</svg>
