<?xml version="1.0" encoding="utf-8"?>
<!-- Generated by IcoMoon.io -->
<!DOCTYPE svg PUBLIC "-//W3C//DTD SVG 1.1//EN" "http://www.w3.org/Graphics/SVG/1.1/DTD/svg11.dtd">
<svg version="1.1" xmlns="http://www.w3.org/2000/svg" xmlns:xlink="http://www.w3.org/1999/xlink" width="16" height="16" viewBox="0 0 16 16">
<path d="M6 10v-2h-2v-1h1v-2h-3v2h1v6h3v-2h-2v-1z"></path>
<path d="M0 0v16h16v-16h-16zM7 15h-6v-12h6v12zM11 15h-3v-12h3v12zM15 15h-3v-12h3v12z"></path>
</svg>
