<?xml version="1.0" encoding="utf-8"?>
<!-- Generated by IcoMoon.io -->
<!DOCTYPE svg PUBLIC "-//W3C//DTD SVG 1.1//EN" "http://www.w3.org/Graphics/SVG/1.1/DTD/svg11.dtd">
<svg version="1.1" xmlns="http://www.w3.org/2000/svg" xmlns:xlink="http://www.w3.org/1999/xlink" width="16" height="16" viewBox="0 0 16 16">
<path d="M16 0.7v-0.7h-0.7l-3 3h-7.3v-3h-2v3h-3v2h3v8h8v3h2v-3h3v-2h-3v-7.3l3-3zM5 5h5.3l-5.3 5.3v-5.3zM11 11h-5.3l5.3-5.3v5.3z"></path>
</svg>
