<?xml version="1.0" encoding="utf-8"?>
<!-- Generated by IcoMoon.io -->
<!DOCTYPE svg PUBLIC "-//W3C//DTD SVG 1.1//EN" "http://www.w3.org/Graphics/SVG/1.1/DTD/svg11.dtd">
<svg version="1.1" xmlns="http://www.w3.org/2000/svg" xmlns:xlink="http://www.w3.org/1999/xlink" width="16" height="16" viewBox="0 0 16 16">
<path d="M14 6.2v7.8h-12v-12h10.5l1-1h-12.5v14h14v-9.8z"></path>
<path d="M7.9 10.9l-4.2-4.2 1.5-1.4 2.7 2.8 6.7-6.7 1.4 1.4z"></path>
</svg>
