{"customer":"müşteri adı","app":"uygulama adı","table":"mould_details","data":[
	{	
		"mould":"string-50 kalıp tablosundaki kod alanındaki değer"
		,"mouldgroup":"string-50 kalıp grup tablosundaki kod alanındaki değer"
		,"opcode":"string-50 operasyon kodu, versiyon olmadan"
		,"opnumber":"int 10,20 şeklinde op numarası"
		,"opname":"string-60 code-number aaa-10 gibi"
		,"leafmask":"string-50 üretim maskesi"
		,"start":"YYYY-MM-DD formatında tarih"
		,"finish":"YYYY-MM-DD formatında tarih bu değer üzerinden işleme kapatılır"
	}
]}
	