{"customer":"müşteri adı","app":"uygulama adı","table":"product_trees_packcapacity","data":[
	{	
		"stockcode":"string-50 hammadde stok kodu"
		,"pack":"string-50 hammadde veya operasyon çıktısının içine konulacağı kasa"
		,"packcapacity":"numeric-10,4 hammadde besleme veya operasyon çıktısı kasa kapasitesi"
	}
]}
	