{"customer":"müşteri adı","app":"uygulama adı","table":"kanban_operations","data":[
	{	
		"product":"string-60"
		,"currentboxcount":"int mevcut kart sayısı"
		,"packaging":"int kasa içi miktar"
		,"boxcount":"int ekranda görüntülenecek kart sayısı"
		,"minboxcount":"int min kart sayısı"
		,"maxboxcount":"int max kart sayısı"
	}
]}
	