{"customer":"müşteri adı","app":"uygulama adı","table":"product_trees","data":[
	{	
		"materialtype":"string-1 M:Mamül,Y:yarımamül,H:hammadde,K:Çıktı kasası,O:Operasyon "
		,"isdefault":"true|false ön tanımlı olduğunu belirten hücre, hammadde için eklendi"
		,"parent":"string-50 producttree.code||null parent operasyon kodu"
		,"code":"string-50 operasyon kodu, versiyon olmadan"
		,"number":"int 10,20 şeklinde op numarası"
		,"name":"string-60 code-number aaa-10 gibi"
		,"description":"string-255 operasyon açıklaması"
		,"stockcode":"string-50 hammadde stok kodu veya operasyon çıktısı stok kodu 16.14085-40"
		,"stockname":"string-60 erp tarafında stok tutulmuyorsa çapraz değer 16.14085/0040"
		,"quantity":"numeric-10,4 hammadde için operasyonda kullanılan miktar"
		,"unit_quantity":"string-50 hammadde için operasyonda kullanılan miktarın birimi Adet"
		,"pack":"string-50 hammadde veya operasyon çıktısının içine konulacağı kasa"
		,"packcapacity":"numeric-10,4 hammadde besleme veya operasyon çıktısı kasa kapasitesi"
		,"unit_packcapacity":"string-50 hammadde besleme veya operasyon çıktısı kasa kapasitesi birimi Adet"
		,"start":"YYYY-MM-DD formatında tarih"
		,"finish":"YYYY-MM-DD formatında tarih bu değer üzerinden işleme kapatılır"
		,"task":"bool hammadde besleme,boş kasa besleme görev oluşturma değeri"
		,"locationsource":"string-50 Kasa Kaynak Lokasyonu"
		,"locationdestination":"string-50 Kasa Hedef Lokasyonu"
		,"goodsplanner":"string-255 hammadde malzemenin tedarik sorumlusu adı"
		,"preptime":"int hazırlık süresi (dakika)"
		,"carrierfeeder":"string-255 Getiren Taşıyıcılar , ile ayrılmış şekilde"
		,"carrierdrainer":"string-255 Götüren Taşıyıcılar , ile ayrılmış şekilde"
		
		,"tpp":"numeric-10,4 birim üretim süresi sn değeri"
		,"opcounter":"int operasyon içindeki operasyon sayısı, x kadar punta"
		,"oporder":"int birden fazla operasyonu olan üretimde operasyon sırasının opno ile belirtilmiyor olması durumunda kullanılıyor"
		,"qualitycontrolrequire":"bool true ise operasyon çıktısının kalite kontrol birimine gitmesi gerekiyor, false ise doğrudan sevkiyat birimine gidecek"
		,"feeder":"string-5 M:mhaz-F:forklift-P:pimesco-K:konveyor"
		,"drainer":"string-5 M:mhaz-F:forklift-P:pimesco-K:konveyor"
		,"delivery":"bool tesellüm yapılacak olan operasyonu belirtir"
		,"productionmultiplier":"int birim üretim süresi çarpanı. erp=10, 80*10/100=8sn"
		,"intervalmultiplier":"int duruşa geçmek için beklenecek parça başı üretim süresi"	
		,"empcount":"int operasyonu yapacak operatör sayısı"
		,"client":"string-50 operasyonun yapılacağı istasyonun kodu"
		,"notificationtime":"int operasyonda kullanılan malzemelerin bildirimi için gerekli süre dakika cinsinden"
	}
]}
	