{"customer":"müşteri adı","app":"uygulama adı","table":"mould_groups","data":[
	{	
		"code":"string-50"
		,"mould":"string-50 kalıp tablosundaki kod alanındaki değer"
		,"productionmultiplier":"int süre katsayısı erp birim üretim süresi değeri düşürmede kullanılan çarpan 0-100"
		,"intervalmultiplier":"int bekleme katsayısı sistemin duruşa geçmesi için kullanılan çarpan 2-10"
		,"setup":"int standart ayar süresi sn"
		,"cycletime":"numeric-10,4 çevrim süresi sn"
		,"lotcount":"int lot kontrol sayısı"
		,"start":"YYYY-MM-DD formatında tarih"
		,"finish":"YYYY-MM-DD formatında tarih bu değer üzerinden işleme kapatılır"
		,"program":"string-4"
	}
]}
	