{"customer":"müşteri adı","app":"uygulama adı","table":"task_reject_details"
	,"data":[
		{
			"type":"t_r"
			,"client":"İstasyon kodu string-50"
			,"day":"YYYY-MM-DD formatında tarih"
			,"jobrotation":"07:30-15:30|15:30-23:30|23:30-07:30 değerlerinden biri"
			,"rejecttype":"Iskarta kodu string-50"
			,"time":"YYYY-MM-DD HH:ii:ss formatında zaman"
			,"opcode":"string-50"
			,"opnumber":"int"
			,"opname":"string-60"
			,"quantityscrap":"Iskarta miktarı int"
			,"erprefnumber":"string-50"
			,"importfilename":"string-50 ıskataya neden olan kaynak istasyon"
		}
	]
	,"deleted":[
		{
			"type":"t_r"
			,"client":"İstasyon kodu string-50"
			,"day":"YYYY-MM-DD formatında tarih"
			,"jobrotation":"07:30-15:30|15:30-23:30|23:30-07:30 değerlerinden biri"
			,"rejecttype":"Iskarta kodu string-50"
			,"time":"YYYY-MM-DD HH:ii:ss formatında zaman"
			,"opcode":"string-50"
			,"opnumber":"int"
			,"opname":"string-60"
			,"quantityscrap":"Iskarta miktarı int"
			,"erprefnumber":"string-50"
			,"importfilename":"string-50 ıskataya neden olan kaynak istasyon"
		}
	]
}
	