<?xml version="1.0" encoding="UTF-8" standalone="no"?>
<svg width="33px" height="61px" viewBox="0 0 33 61" version="1.1" xmlns="http://www.w3.org/2000/svg" xmlns:xlink="http://www.w3.org/1999/xlink">
    <!-- Generator: Sketch 47.1 (45422) - http://www.bohemiancoding.com/sketch -->
    <title>4F</title>
    <desc>Created with Sketch.</desc>
    <defs></defs>
    <g id="台北南西店" stroke="none" stroke-width="1" fill="none" fill-rule="evenodd">
        <g id="all" transform="translate(-375.000000, -381.000000)"></g>
        <g id="two" transform="translate(0.000000, -381.000000)">
            <g id="4F" transform="translate(8.000000, 381.000000)">
                <rect id="Bg" fill="#F0F2F7" x="0" y="0" width="359" height="61"></rect>
                <g id="window_l" transform="translate(14.500000, 36.500000) scale(-1, 1) translate(-14.500000, -36.500000) translate(4.000000, 17.000000)">
                    <polygon id="window" fill="#E2E6EE" points="0 0 21 11.0275832 21 38.0823145 0 38.0823145"></polygon>
                    <polygon id="window" fill="#F0F2F7" points="9 4.73045885 12 6.27509129 12 37.9230464 9 37.9230464"></polygon>
                    <polygon id="window" fill="#FFFFFF" points="12 6.34234236 13 6.8926476 13 37.8933255 12 37.8933255"></polygon>
                    <polygon id="window" fill="#CAD1DD" points="8 4.21785723 9 4.78273692 9 37.8933255 8 37.8933255"></polygon>
                    <polyline id="Path-2" fill="#CAD1DD" points="12.0550648 6.34234236 20.9927359 11.0275832 20.9927359 12.1247767 12.0550648 7.43722073"></polyline>
                    <polyline id="Path-2" fill="#CAD1DD" points="-1.13686838e-13 0 8.01951781 4.23705573 8.01951781 5.33424926 -1.13686838e-13 1.09487837"></polyline>
                </g>
            </g>
        </g>
    </g>
</svg>