<?xml version="1.0" encoding="UTF-8" standalone="no"?>
<svg width="33px" height="61px" viewBox="0 0 33 61" version="1.1" xmlns="http://www.w3.org/2000/svg" xmlns:xlink="http://www.w3.org/1999/xlink">
    <!-- Generator: Sketch 47.1 (45422) - http://www.bohemiancoding.com/sketch -->
    <title>中港店 4F</title>
    <desc>Created with Sketch.</desc>
    <defs></defs>
    <g id="中港店" stroke="none" stroke-width="1" fill="none" fill-rule="evenodd">
        <g transform="translate(0.000000, -724.000000)" id="4F">
            <g transform="translate(8.000000, 724.000000)">
                <rect id="Bg" fill="#F0BDB7" x="0" y="0" width="359" height="61"></rect>
                <rect id="line" fill="#8C8686" x="0" y="59" width="359" height="2"></rect>
                <rect id="line" fill="#8C8686" x="0" y="19" width="359" height="2"></rect>
                <rect id="line2" fill="#8C8686" x="6" y="0" width="2" height="59"></rect>
            </g>
        </g>
    </g>
</svg>