<svg xmlns="http://www.w3.org/2000/svg" xmlns:xlink="http://www.w3.org/1999/xlink" width="96" height="96" viewBox="0 0 96 96">
    <defs>
        <path id="a" d="M16 73.5a2 2 0 1 1 0-4h64a2 2 0 1 1 0 4H16zM80 61a2 2 0 0 1-2 2H18a2 2 0 0 1-2-2c0-17.673 14.327-32 32-32 17.673 0 32 14.327 32 32zM48 33c-14.792 0-26.904 11.47-27.93 26h55.86C74.904 44.47 62.792 33 48 33zm-6-8.5a2 2 0 1 1 0-4h12a2 2 0 1 1 0 4H42z"/>
    </defs>
    <g fill="none" fill-rule="evenodd">
        <path fill="none" d="M0 0h96v96H0z"/>
        <use fill="#DE0716" fill-rule="nonzero" xlink:href="#a"/>
    </g>
</svg>
