<?xml version="1.0" encoding="UTF-8" standalone="no"?>
<svg width="33px" height="61px" viewBox="0 0 33 61" version="1.1" xmlns="http://www.w3.org/2000/svg" xmlns:xlink="http://www.w3.org/1999/xlink">
    <!-- Generator: Sketch 48.2 (47327) - http://www.bohemiancoding.com/sketch -->
    <title>A-3</title>
    <desc>Created with Sketch.</desc>
    <defs></defs>
    <g id="A" stroke="none" stroke-width="1" fill="none" fill-rule="evenodd" transform="translate(0.000000, -374.000000)">
        <g id="3F" transform="translate(8.000000, 374.000000)">
            <rect id="wall" fill="#CAD1DD" x="5" y="35" width="349" height="21"></rect>
            <rect id="shadows" fill-opacity="0.1" fill="#000000" x="5" y="35" width="349" height="2"></rect>
            <rect id="wall" fill="#E2E6EE" x="0" y="56" width="359" height="5"></rect>
            <rect id="wall" fill="#E2E6EE" x="3" y="0" width="353" height="35"></rect>
            <g id="line" transform="translate(3.000000, 17.000000)" fill="#CAD1DD">
                <rect x="0" y="0" width="353" height="1"></rect>
            </g>
        </g>
    </g>
</svg>