<?xml version="1.0" encoding="UTF-8" standalone="no"?>
<svg width="33px" height="61px" viewBox="0 0 33 61" version="1.1" xmlns="http://www.w3.org/2000/svg" xmlns:xlink="http://www.w3.org/1999/xlink">
    <!-- Generator: Sketch 47.1 (45422) - http://www.bohemiancoding.com/sketch -->
    <title>5F</title>
    <desc>Created with Sketch.</desc>
    <defs></defs>
    <g id="台北南西店" stroke="none" stroke-width="1" fill="none" fill-rule="evenodd">
        <g id="all" transform="translate(-750.000000, -320.000000)"></g>
        <g id="three" transform="translate(0.000000, -320.000000)">
            <g id="5F" transform="translate(8.000000, 320.000000)">
                <rect id="Bg" fill="#E2E6EE" x="0" y="0" width="359" height="61"></rect>
                <g id="lines" fill-rule="nonzero" fill="#CAD1DD">
                    <polygon id="Line-Copy" points="10 0 10 61 9 61 9 0"></polygon>
                    <polygon id="Line-Copy" points="20 0 20 61 19 61 19 0"></polygon>
                    <polygon id="Line-2" points="359 44 -2.84217094e-14 44 -2.84217094e-14 43 359 43"></polygon>
                    <polygon id="Line-2-Copy-3" points="359 56 -2.84217094e-14 56 -2.84217094e-14 55 359 55"></polygon>
                </g>
                <rect id="Bg_window" fill="#E1F2FB" x="3" y="0" width="353" height="32"></rect>
                <g id="window" transform="translate(2.000000, 0.000000)">
                    <rect id="Rectangle-4" fill="#CAD1DD" x="13" y="0" width="1" height="32"></rect>
                    <rect id="Rectangle-4" fill="#FFFFFF" x="10" y="0" width="1" height="15"></rect>
                    <rect id="Rectangle-4" fill="#FFFFFF" transform="translate(5.750000, 14.500000) rotate(-270.000000) translate(-5.750000, -14.500000) " x="5.25" y="9.5" width="1" height="10"></rect>
                    <rect id="Rectangle-4" fill="#CAD1DD" transform="translate(5.500000, 17.500000) rotate(-270.000000) translate(-5.500000, -17.500000) " x="5" y="13" width="1" height="9"></rect>
                    <rect id="Rectangle-4" fill="#CAD1DD" transform="translate(18.500000, 17.500000) rotate(-270.000000) translate(-18.500000, -17.500000) " x="18" y="13" width="1" height="9"></rect>
                    <rect id="Rectangle-4" fill="#CAD1DD" transform="translate(5.500000, 0.500000) rotate(-270.000000) translate(-5.500000, -0.500000) " x="5" y="-4" width="1" height="9"></rect>
                    <rect id="Rectangle-4" fill="#FFFFFF" x="10" y="17" width="1" height="15"></rect>
                    <rect id="Rectangle-4" fill="#CAD1DD" x="0" y="0" width="1" height="32"></rect>
                    <rect id="Rectangle-4" fill="#FFFFFF" transform="translate(18.500000, 14.500000) rotate(-270.000000) translate(-18.500000, -14.500000) " x="18" y="9" width="1" height="11"></rect>
                    <rect id="Rectangle-4" fill="#FFFFFF" transform="translate(6.000000, 31.500000) rotate(-270.000000) translate(-6.000000, -31.500000) " x="5.5" y="26.5" width="1" height="10"></rect>
                    <rect id="Rectangle-4" fill="#FFFFFF" transform="translate(18.500000, 31.500000) rotate(-270.000000) translate(-18.500000, -31.500000) " x="18" y="26" width="1" height="11"></rect>
                    <rect id="Rectangle-7" fill="#CAD1DD" x="14" y="0" width="9" height="1"></rect>
                    <rect id="Rectangle-5" fill="#E2E6EE" x="0" y="15" width="355" height="2"></rect>
                    <rect id="Rectangle-4" fill="#E2E6EE" x="11" y="0" width="2" height="32"></rect>
                </g>
            </g>
        </g>
    </g>
</svg>