<?xml version="1.0" encoding="UTF-8"?>
<svg width="33px" height="61px" viewBox="0 0 33 61" version="1.1" xmlns="http://www.w3.org/2000/svg" xmlns:xlink="http://www.w3.org/1999/xlink">
    <!-- Generator: Sketch 48.2 (47327) - http://www.bohemiancoding.com/sketch -->
    <title>7</title>
    <desc>Created with Sketch.</desc>
    <defs></defs>
    <g id="one" stroke="none" stroke-width="1" fill="none" fill-rule="evenodd" transform="translate(0.000000, -383.000000)">
        <g id="4F" transform="translate(10.000000, 381.000000)">
            <g>
                <rect id="Bg" fill="#E1F2FB" x="4" y="2" width="347" height="56"></rect>
                <rect id="Bg" fill="#968E89" x="1" y="61" width="353" height="2"></rect>
                <rect id="Rectangle-4" fill="#9E9791" x="2" y="2" width="2" height="56"></rect>
                <rect id="Rectangle-4" fill="#B49F8B" x="334" y="61" width="2" height="2"></rect>
                <rect id="Rectangle-4" fill="#B49F8B" x="346" y="61" width="2" height="2"></rect>
                <rect id="Rectangle-4" fill="#9E9791" x="351" y="2" width="2" height="56"></rect>
                <rect id="Rectangle-4" fill="#B49F8B" x="19" y="61" width="2" height="2"></rect>
                <rect id="Rectangle-4" fill="#B49F8B" x="7" y="61" width="2" height="2"></rect>
                <rect id="Bg" fill="#9E9791" x="0" y="58" width="355" height="3"></rect>
                <rect id="Rectangle-4" fill="#FFFFFF" x="15" y="2" width="1" height="61"></rect>
                <rect id="Rectangle-4" fill="#FFFFFF" x="12" y="2" width="1" height="61"></rect>
                <rect id="Rectangle-4" fill="#F0F2F7" x="13" y="2" width="2" height="61"></rect>
                <rect id="Rectangle-4" fill="#F0F2F7" x="340" y="2" width="2" height="61"></rect>
                <rect id="Rectangle-4" fill="#FFFFFF" x="339" y="2" width="1" height="61"></rect>
                <rect id="Rectangle-4" fill="#FFFFFF" x="342" y="2" width="1" height="61"></rect>
                <g id="plant">
                    <path d="M5.16874947,9.64064121 C6.98495128,6.65183642 6.72384481,4.05542206 4.38543006,1.85139815 C2.79392843,4.58858718 3.0550349,7.18500154 5.16874947,9.64064121 Z" id="Path-3" fill="#DCABAB" transform="translate(4.859860, 5.746020) rotate(-33.000000) translate(-4.859860, -5.746020) "></path>
                    <path d="M5.359442,13.3570703 C7.17564381,10.3682655 6.91453735,7.77185117 4.5761226,5.56782726 C2.98462097,8.30501629 3.24572744,10.9014306 5.359442,13.3570703 Z" id="Path-3" fill="#CB9494" transform="translate(5.050552, 9.462449) rotate(-55.000000) translate(-5.050552, -9.462449) "></path>
                    <path d="M7.85955227,15.2675507 C6.97122582,11.8848862 4.92214184,10.2690895 1.71230035,10.4201607 C2.57571943,13.4664024 4.6248034,15.0821991 7.85955227,15.2675507 Z" id="Path-3" fill="#DCABAB"></path>
                    <path d="M7.85955227,18.2675507 C6.97122582,14.8848862 4.92214184,13.2690895 1.71230035,13.4201607 C2.57571943,16.4664024 4.6248034,18.0821991 7.85955227,18.2675507 Z" id="Path-3" fill="#CB9494"></path>
                    <path d="M5.349725,22.3461271 C7.16592681,19.3573223 6.90482034,16.760908 4.5664056,14.5568841 C2.97490396,17.2940731 3.23601043,19.8904875 5.349725,22.3461271 Z" id="Path-3" fill="#DCABAB" transform="translate(5.040835, 18.451506) rotate(-71.000000) translate(-5.040835, -18.451506) "></path>
                    <path d="M8.68791283,9.00363957 C10.5041146,6.01483477 10.2430082,3.41842042 7.90459343,1.2143965 C6.3130918,3.95158554 6.57419827,6.54799989 8.68791283,9.00363957 Z" id="Path-3" fill="#CB9494" transform="translate(8.379023, 5.109018) scale(-1, 1) rotate(-33.000000) translate(-8.379023, -5.109018) "></path>
                    <path d="M7.03973171,8.04808374 C8.85593352,5.05927894 8.59482706,2.46286459 6.25641231,0.258840674 C4.66491068,2.99602971 4.92601714,5.59244406 7.03973171,8.04808374 Z" id="Path-3" fill="#DCABAB" transform="translate(6.730842, 4.153462) scale(-1, 1) rotate(10.000000) translate(-6.730842, -4.153462) "></path>
                    <path d="M9.359442,11.38292 C11.1756438,8.39411525 10.9145373,5.79770089 8.5761226,3.59367698 C6.98462097,6.33086601 7.24572744,8.92728037 9.359442,11.38292 Z" id="Path-3" fill="#CB9494" transform="translate(9.050552, 7.488299) scale(-1, 1) rotate(-55.000000) translate(-9.050552, -7.488299) "></path>
                    <path d="M10.359442,22.3570703 C12.1756438,19.3682655 11.9145373,16.7718512 9.5761226,14.5678273 C7.98462097,17.3050163 8.24572744,19.9014306 10.359442,22.3570703 Z" id="Path-3" fill="#DCABAB" transform="translate(10.050552, 18.462449) scale(-1, 1) rotate(-55.000000) translate(-10.050552, -18.462449) "></path>
                    <path d="M12.1472519,12.8829275 C11.2589255,9.50026296 9.2098415,7.88446627 6,8.03553741 C6.86341908,11.0817791 8.91250306,12.6975758 12.1472519,12.8829275 Z" id="Path-3" fill="#DCABAB" transform="translate(9.073626, 10.454389) scale(-1, 1) translate(-9.073626, -10.454389) "></path>
                    <path d="M12.1472519,15.8829275 C11.2589255,12.500263 9.2098415,10.8844663 6,11.0355374 C6.86341908,14.0817791 8.91250306,15.6975758 12.1472519,15.8829275 Z" id="Path-3" fill="#DCABAB" transform="translate(9.073626, 13.454389) scale(-1, 1) translate(-9.073626, -13.454389) "></path>
                    <path d="M9.47962251,19.6065495 C11.2958243,16.6177447 11.0347179,14.0213303 8.69630311,11.8173064 C7.10480148,14.5544954 7.36590794,17.1509098 9.47962251,19.6065495 Z" id="Path-3" fill="#CB9494" transform="translate(9.170733, 15.711928) scale(-1, 1) rotate(-71.000000) translate(-9.170733, -15.711928) "></path>
                </g>
                <g id="plant" transform="translate(12.000000, 0.000000)">
                    <path d="M5.16874947,9.64064121 C6.98495128,6.65183642 6.72384481,4.05542206 4.38543006,1.85139815 C2.79392843,4.58858718 3.0550349,7.18500154 5.16874947,9.64064121 Z" id="Path-3" fill="#CB9494" transform="translate(4.859860, 5.746020) rotate(-33.000000) translate(-4.859860, -5.746020) "></path>
                    <path d="M5.359442,13.3570703 C7.17564381,10.3682655 6.91453735,7.77185117 4.5761226,5.56782726 C2.98462097,8.30501629 3.24572744,10.9014306 5.359442,13.3570703 Z" id="Path-3" fill="#DCABAB" transform="translate(5.050552, 9.462449) rotate(-40.000000) translate(-5.050552, -9.462449) "></path>
                    <path d="M7.85955227,15.2675507 C6.97122582,11.8848862 4.92214184,10.2690895 1.71230035,10.4201607 C2.57571943,13.4664024 4.6248034,15.0821991 7.85955227,15.2675507 Z" id="Path-3" fill="#CB9494"></path>
                    <path d="M8.48931767,18.3079995 C7.60099122,14.9253349 5.55190724,13.3095382 2.34206574,13.4606094 C3.20548483,16.5068511 5.2545688,18.1226478 8.48931767,18.3079995 Z" id="Path-3" fill="#DCABAB" transform="translate(5.415692, 15.879461) rotate(-9.000000) translate(-5.415692, -15.879461) "></path>
                    <path d="M5.349725,22.3461271 C7.16592681,19.3573223 6.90482034,16.760908 4.5664056,14.5568841 C2.97490396,17.2940731 3.23601043,19.8904875 5.349725,22.3461271 Z" id="Path-3" fill="#CB9494" transform="translate(5.040835, 18.451506) rotate(-71.000000) translate(-5.040835, -18.451506) "></path>
                    <path d="M8.68791283,9.00363957 C10.5041146,6.01483477 10.2430082,3.41842042 7.90459343,1.2143965 C6.3130918,3.95158554 6.57419827,6.54799989 8.68791283,9.00363957 Z" id="Path-3" fill="#CB9494" transform="translate(8.379023, 5.109018) scale(-1, 1) rotate(-33.000000) translate(-8.379023, -5.109018) "></path>
                    <path d="M7.03973171,8.04808374 C8.85593352,5.05927894 8.59482706,2.46286459 6.25641231,0.258840674 C4.66491068,2.99602971 4.92601714,5.59244406 7.03973171,8.04808374 Z" id="Path-3" fill="#DCABAB" transform="translate(6.730842, 4.153462) scale(-1, 1) rotate(10.000000) translate(-6.730842, -4.153462) "></path>
                    <path d="M9.359442,11.38292 C11.1756438,8.39411525 10.9145373,5.79770089 8.5761226,3.59367698 C6.98462097,6.33086601 7.24572744,8.92728037 9.359442,11.38292 Z" id="Path-3" fill="#DCABAB" transform="translate(9.050552, 7.488299) scale(-1, 1) rotate(-55.000000) translate(-9.050552, -7.488299) "></path>
                    <path d="M10.359442,22.3570703 C12.1756438,19.3682655 11.9145373,16.7718512 9.5761226,14.5678273 C7.98462097,17.3050163 8.24572744,19.9014306 10.359442,22.3570703 Z" id="Path-3" fill="#DCABAB" transform="translate(10.050552, 18.462449) scale(-1, 1) rotate(-55.000000) translate(-10.050552, -18.462449) "></path>
                    <path d="M12.1472519,12.8829275 C11.2589255,9.50026296 9.2098415,7.88446627 6,8.03553741 C6.86341908,11.0817791 8.91250306,12.6975758 12.1472519,12.8829275 Z" id="Path-3" fill="#CB9494" transform="translate(9.073626, 10.454389) scale(-1, 1) translate(-9.073626, -10.454389) "></path>
                    <path d="M12.0748929,15.8455656 C11.1865664,12.4629011 9.13748246,10.8471044 5.92764097,10.9981756 C6.79106005,14.0444173 8.84014402,15.660214 12.0748929,15.8455656 Z" id="Path-3" fill="#DCABAB" transform="translate(9.001267, 13.417027) scale(-1, 1) rotate(6.000000) translate(-9.001267, -13.417027) "></path>
                    <path d="M9.64396738,19.9727193 C11.4601692,16.9839145 11.1990627,14.3875001 8.86064797,12.1834762 C7.26914634,14.9206653 7.53025281,17.5170796 9.64396738,19.9727193 Z" id="Path-3" fill="#CB9494" transform="translate(9.335077, 16.078098) scale(-1, 1) rotate(-50.000000) translate(-9.335077, -16.078098) "></path>
                </g>
                <g id="plant" transform="translate(0.000000, 19.000000)">
                    <path d="M5.16874947,9.64064121 C6.98495128,6.65183642 6.72384481,4.05542206 4.38543006,1.85139815 C2.79392843,4.58858718 3.0550349,7.18500154 5.16874947,9.64064121 Z" id="Path-3" fill="#DCABAB" transform="translate(4.859860, 5.746020) rotate(-33.000000) translate(-4.859860, -5.746020) "></path>
                    <path d="M5.359442,13.3570703 C7.17564381,10.3682655 6.91453735,7.77185117 4.5761226,5.56782726 C2.98462097,8.30501629 3.24572744,10.9014306 5.359442,13.3570703 Z" id="Path-3" fill="#CB9494" transform="translate(5.050552, 9.462449) rotate(-55.000000) translate(-5.050552, -9.462449) "></path>
                    <path d="M7.85955227,15.2675507 C6.97122582,11.8848862 4.92214184,10.2690895 1.71230035,10.4201607 C2.57571943,13.4664024 4.6248034,15.0821991 7.85955227,15.2675507 Z" id="Path-3" fill="#DCABAB"></path>
                    <path d="M7.85955227,18.2675507 C6.97122582,14.8848862 4.92214184,13.2690895 1.71230035,13.4201607 C2.57571943,16.4664024 4.6248034,18.0821991 7.85955227,18.2675507 Z" id="Path-3" fill="#CB9494"></path>
                    <path d="M5.349725,22.3461271 C7.16592681,19.3573223 6.90482034,16.760908 4.5664056,14.5568841 C2.97490396,17.2940731 3.23601043,19.8904875 5.349725,22.3461271 Z" id="Path-3" fill="#DCABAB" transform="translate(5.040835, 18.451506) rotate(-71.000000) translate(-5.040835, -18.451506) "></path>
                    <path d="M8.68791283,9.00363957 C10.5041146,6.01483477 10.2430082,3.41842042 7.90459343,1.2143965 C6.3130918,3.95158554 6.57419827,6.54799989 8.68791283,9.00363957 Z" id="Path-3" fill="#CB9494" transform="translate(8.379023, 5.109018) scale(-1, 1) rotate(-33.000000) translate(-8.379023, -5.109018) "></path>
                    <path d="M7.03973171,8.04808374 C8.85593352,5.05927894 8.59482706,2.46286459 6.25641231,0.258840674 C4.66491068,2.99602971 4.92601714,5.59244406 7.03973171,8.04808374 Z" id="Path-3" fill="#DCABAB" transform="translate(6.730842, 4.153462) scale(-1, 1) rotate(10.000000) translate(-6.730842, -4.153462) "></path>
                    <path d="M9.359442,11.38292 C11.1756438,8.39411525 10.9145373,5.79770089 8.5761226,3.59367698 C6.98462097,6.33086601 7.24572744,8.92728037 9.359442,11.38292 Z" id="Path-3" fill="#CB9494" transform="translate(9.050552, 7.488299) scale(-1, 1) rotate(-55.000000) translate(-9.050552, -7.488299) "></path>
                    <path d="M10.359442,22.3570703 C12.1756438,19.3682655 11.9145373,16.7718512 9.5761226,14.5678273 C7.98462097,17.3050163 8.24572744,19.9014306 10.359442,22.3570703 Z" id="Path-3" fill="#DCABAB" transform="translate(10.050552, 18.462449) scale(-1, 1) rotate(-55.000000) translate(-10.050552, -18.462449) "></path>
                    <path d="M12.1472519,12.8829275 C11.2589255,9.50026296 9.2098415,7.88446627 6,8.03553741 C6.86341908,11.0817791 8.91250306,12.6975758 12.1472519,12.8829275 Z" id="Path-3" fill="#DCABAB" transform="translate(9.073626, 10.454389) scale(-1, 1) translate(-9.073626, -10.454389) "></path>
                    <path d="M12.1472519,15.8829275 C11.2589255,12.500263 9.2098415,10.8844663 6,11.0355374 C6.86341908,14.0817791 8.91250306,15.6975758 12.1472519,15.8829275 Z" id="Path-3" fill="#DCABAB" transform="translate(9.073626, 13.454389) scale(-1, 1) translate(-9.073626, -13.454389) "></path>
                    <path d="M9.47962251,19.6065495 C11.2958243,16.6177447 11.0347179,14.0213303 8.69630311,11.8173064 C7.10480148,14.5544954 7.36590794,17.1509098 9.47962251,19.6065495 Z" id="Path-3" fill="#CB9494" transform="translate(9.170733, 15.711928) scale(-1, 1) rotate(-71.000000) translate(-9.170733, -15.711928) "></path>
                </g>
                <g id="plant" transform="translate(12.000000, 19.000000)">
                    <path d="M5.16874947,9.64064121 C6.98495128,6.65183642 6.72384481,4.05542206 4.38543006,1.85139815 C2.79392843,4.58858718 3.0550349,7.18500154 5.16874947,9.64064121 Z" id="Path-3" fill="#CB9494" transform="translate(4.859860, 5.746020) rotate(-33.000000) translate(-4.859860, -5.746020) "></path>
                    <path d="M5.359442,13.3570703 C7.17564381,10.3682655 6.91453735,7.77185117 4.5761226,5.56782726 C2.98462097,8.30501629 3.24572744,10.9014306 5.359442,13.3570703 Z" id="Path-3" fill="#DCABAB" transform="translate(5.050552, 9.462449) rotate(-40.000000) translate(-5.050552, -9.462449) "></path>
                    <path d="M7.85955227,15.2675507 C6.97122582,11.8848862 4.92214184,10.2690895 1.71230035,10.4201607 C2.57571943,13.4664024 4.6248034,15.0821991 7.85955227,15.2675507 Z" id="Path-3" fill="#CB9494"></path>
                    <path d="M8.48931767,18.3079995 C7.60099122,14.9253349 5.55190724,13.3095382 2.34206574,13.4606094 C3.20548483,16.5068511 5.2545688,18.1226478 8.48931767,18.3079995 Z" id="Path-3" fill="#DCABAB" transform="translate(5.415692, 15.879461) rotate(-9.000000) translate(-5.415692, -15.879461) "></path>
                    <path d="M5.349725,22.3461271 C7.16592681,19.3573223 6.90482034,16.760908 4.5664056,14.5568841 C2.97490396,17.2940731 3.23601043,19.8904875 5.349725,22.3461271 Z" id="Path-3" fill="#CB9494" transform="translate(5.040835, 18.451506) rotate(-71.000000) translate(-5.040835, -18.451506) "></path>
                    <path d="M8.68791283,9.00363957 C10.5041146,6.01483477 10.2430082,3.41842042 7.90459343,1.2143965 C6.3130918,3.95158554 6.57419827,6.54799989 8.68791283,9.00363957 Z" id="Path-3" fill="#CB9494" transform="translate(8.379023, 5.109018) scale(-1, 1) rotate(-33.000000) translate(-8.379023, -5.109018) "></path>
                    <path d="M7.03973171,8.04808374 C8.85593352,5.05927894 8.59482706,2.46286459 6.25641231,0.258840674 C4.66491068,2.99602971 4.92601714,5.59244406 7.03973171,8.04808374 Z" id="Path-3" fill="#DCABAB" transform="translate(6.730842, 4.153462) scale(-1, 1) rotate(10.000000) translate(-6.730842, -4.153462) "></path>
                    <path d="M9.359442,11.38292 C11.1756438,8.39411525 10.9145373,5.79770089 8.5761226,3.59367698 C6.98462097,6.33086601 7.24572744,8.92728037 9.359442,11.38292 Z" id="Path-3" fill="#DCABAB" transform="translate(9.050552, 7.488299) scale(-1, 1) rotate(-55.000000) translate(-9.050552, -7.488299) "></path>
                    <path d="M10.359442,22.3570703 C12.1756438,19.3682655 11.9145373,16.7718512 9.5761226,14.5678273 C7.98462097,17.3050163 8.24572744,19.9014306 10.359442,22.3570703 Z" id="Path-3" fill="#DCABAB" transform="translate(10.050552, 18.462449) scale(-1, 1) rotate(-55.000000) translate(-10.050552, -18.462449) "></path>
                    <path d="M12.1472519,12.8829275 C11.2589255,9.50026296 9.2098415,7.88446627 6,8.03553741 C6.86341908,11.0817791 8.91250306,12.6975758 12.1472519,12.8829275 Z" id="Path-3" fill="#CB9494" transform="translate(9.073626, 10.454389) scale(-1, 1) translate(-9.073626, -10.454389) "></path>
                    <path d="M12.0748929,15.8455656 C11.1865664,12.4629011 9.13748246,10.8471044 5.92764097,10.9981756 C6.79106005,14.0444173 8.84014402,15.660214 12.0748929,15.8455656 Z" id="Path-3" fill="#DCABAB" transform="translate(9.001267, 13.417027) scale(-1, 1) rotate(6.000000) translate(-9.001267, -13.417027) "></path>
                    <path d="M9.64396738,19.9727193 C11.4601692,16.9839145 11.1990627,14.3875001 8.86064797,12.1834762 C7.26914634,14.9206653 7.53025281,17.5170796 9.64396738,19.9727193 Z" id="Path-3" fill="#CB9494" transform="translate(9.335077, 16.078098) scale(-1, 1) rotate(-50.000000) translate(-9.335077, -16.078098) "></path>
                </g>
                <g id="plant" transform="translate(0.000000, 38.000000)">
                    <path d="M5.16874947,9.64064121 C6.98495128,6.65183642 6.72384481,4.05542206 4.38543006,1.85139815 C2.79392843,4.58858718 3.0550349,7.18500154 5.16874947,9.64064121 Z" id="Path-3" fill="#DCABAB" transform="translate(4.859860, 5.746020) rotate(-33.000000) translate(-4.859860, -5.746020) "></path>
                    <path d="M5.359442,13.3570703 C7.17564381,10.3682655 6.91453735,7.77185117 4.5761226,5.56782726 C2.98462097,8.30501629 3.24572744,10.9014306 5.359442,13.3570703 Z" id="Path-3" fill="#CB9494" transform="translate(5.050552, 9.462449) rotate(-55.000000) translate(-5.050552, -9.462449) "></path>
                    <path d="M7.85955227,15.2675507 C6.97122582,11.8848862 4.92214184,10.2690895 1.71230035,10.4201607 C2.57571943,13.4664024 4.6248034,15.0821991 7.85955227,15.2675507 Z" id="Path-3" fill="#DCABAB"></path>
                    <path d="M7.85955227,18.2675507 C6.97122582,14.8848862 4.92214184,13.2690895 1.71230035,13.4201607 C2.57571943,16.4664024 4.6248034,18.0821991 7.85955227,18.2675507 Z" id="Path-3" fill="#CB9494"></path>
                    <path d="M5.349725,22.3461271 C7.16592681,19.3573223 6.90482034,16.760908 4.5664056,14.5568841 C2.97490396,17.2940731 3.23601043,19.8904875 5.349725,22.3461271 Z" id="Path-3" fill="#DCABAB" transform="translate(5.040835, 18.451506) rotate(-71.000000) translate(-5.040835, -18.451506) "></path>
                    <path d="M8.68791283,9.00363957 C10.5041146,6.01483477 10.2430082,3.41842042 7.90459343,1.2143965 C6.3130918,3.95158554 6.57419827,6.54799989 8.68791283,9.00363957 Z" id="Path-3" fill="#CB9494" transform="translate(8.379023, 5.109018) scale(-1, 1) rotate(-33.000000) translate(-8.379023, -5.109018) "></path>
                    <path d="M7.03973171,8.04808374 C8.85593352,5.05927894 8.59482706,2.46286459 6.25641231,0.258840674 C4.66491068,2.99602971 4.92601714,5.59244406 7.03973171,8.04808374 Z" id="Path-3" fill="#DCABAB" transform="translate(6.730842, 4.153462) scale(-1, 1) rotate(10.000000) translate(-6.730842, -4.153462) "></path>
                    <path d="M9.359442,11.38292 C11.1756438,8.39411525 10.9145373,5.79770089 8.5761226,3.59367698 C6.98462097,6.33086601 7.24572744,8.92728037 9.359442,11.38292 Z" id="Path-3" fill="#CB9494" transform="translate(9.050552, 7.488299) scale(-1, 1) rotate(-55.000000) translate(-9.050552, -7.488299) "></path>
                    <path d="M10.359442,22.3570703 C12.1756438,19.3682655 11.9145373,16.7718512 9.5761226,14.5678273 C7.98462097,17.3050163 8.24572744,19.9014306 10.359442,22.3570703 Z" id="Path-3" fill="#DCABAB" transform="translate(10.050552, 18.462449) scale(-1, 1) rotate(-55.000000) translate(-10.050552, -18.462449) "></path>
                    <path d="M12.1472519,12.8829275 C11.2589255,9.50026296 9.2098415,7.88446627 6,8.03553741 C6.86341908,11.0817791 8.91250306,12.6975758 12.1472519,12.8829275 Z" id="Path-3" fill="#DCABAB" transform="translate(9.073626, 10.454389) scale(-1, 1) translate(-9.073626, -10.454389) "></path>
                    <path d="M12.1472519,15.8829275 C11.2589255,12.500263 9.2098415,10.8844663 6,11.0355374 C6.86341908,14.0817791 8.91250306,15.6975758 12.1472519,15.8829275 Z" id="Path-3" fill="#DCABAB" transform="translate(9.073626, 13.454389) scale(-1, 1) translate(-9.073626, -13.454389) "></path>
                    <path d="M9.47962251,19.6065495 C11.2958243,16.6177447 11.0347179,14.0213303 8.69630311,11.8173064 C7.10480148,14.5544954 7.36590794,17.1509098 9.47962251,19.6065495 Z" id="Path-3" fill="#CB9494" transform="translate(9.170733, 15.711928) scale(-1, 1) rotate(-71.000000) translate(-9.170733, -15.711928) "></path>
                </g>
                <g id="plant" transform="translate(12.000000, 38.000000)">
                    <path d="M5.16874947,9.64064121 C6.98495128,6.65183642 6.72384481,4.05542206 4.38543006,1.85139815 C2.79392843,4.58858718 3.0550349,7.18500154 5.16874947,9.64064121 Z" id="Path-3" fill="#CB9494" transform="translate(4.859860, 5.746020) rotate(-33.000000) translate(-4.859860, -5.746020) "></path>
                    <path d="M5.359442,13.3570703 C7.17564381,10.3682655 6.91453735,7.77185117 4.5761226,5.56782726 C2.98462097,8.30501629 3.24572744,10.9014306 5.359442,13.3570703 Z" id="Path-3" fill="#DCABAB" transform="translate(5.050552, 9.462449) rotate(-40.000000) translate(-5.050552, -9.462449) "></path>
                    <path d="M7.85955227,15.2675507 C6.97122582,11.8848862 4.92214184,10.2690895 1.71230035,10.4201607 C2.57571943,13.4664024 4.6248034,15.0821991 7.85955227,15.2675507 Z" id="Path-3" fill="#CB9494"></path>
                    <path d="M8.48931767,18.3079995 C7.60099122,14.9253349 5.55190724,13.3095382 2.34206574,13.4606094 C3.20548483,16.5068511 5.2545688,18.1226478 8.48931767,18.3079995 Z" id="Path-3" fill="#DCABAB" transform="translate(5.415692, 15.879461) rotate(-9.000000) translate(-5.415692, -15.879461) "></path>
                    <path d="M5.349725,22.3461271 C7.16592681,19.3573223 6.90482034,16.760908 4.5664056,14.5568841 C2.97490396,17.2940731 3.23601043,19.8904875 5.349725,22.3461271 Z" id="Path-3" fill="#CB9494" transform="translate(5.040835, 18.451506) rotate(-71.000000) translate(-5.040835, -18.451506) "></path>
                    <path d="M8.68791283,9.00363957 C10.5041146,6.01483477 10.2430082,3.41842042 7.90459343,1.2143965 C6.3130918,3.95158554 6.57419827,6.54799989 8.68791283,9.00363957 Z" id="Path-3" fill="#CB9494" transform="translate(8.379023, 5.109018) scale(-1, 1) rotate(-33.000000) translate(-8.379023, -5.109018) "></path>
                    <path d="M7.03973171,8.04808374 C8.85593352,5.05927894 8.59482706,2.46286459 6.25641231,0.258840674 C4.66491068,2.99602971 4.92601714,5.59244406 7.03973171,8.04808374 Z" id="Path-3" fill="#DCABAB" transform="translate(6.730842, 4.153462) scale(-1, 1) rotate(10.000000) translate(-6.730842, -4.153462) "></path>
                    <path d="M9.359442,11.38292 C11.1756438,8.39411525 10.9145373,5.79770089 8.5761226,3.59367698 C6.98462097,6.33086601 7.24572744,8.92728037 9.359442,11.38292 Z" id="Path-3" fill="#DCABAB" transform="translate(9.050552, 7.488299) scale(-1, 1) rotate(-55.000000) translate(-9.050552, -7.488299) "></path>
                    <path d="M10.359442,22.3570703 C12.1756438,19.3682655 11.9145373,16.7718512 9.5761226,14.5678273 C7.98462097,17.3050163 8.24572744,19.9014306 10.359442,22.3570703 Z" id="Path-3" fill="#DCABAB" transform="translate(10.050552, 18.462449) scale(-1, 1) rotate(-55.000000) translate(-10.050552, -18.462449) "></path>
                    <path d="M12.1472519,12.8829275 C11.2589255,9.50026296 9.2098415,7.88446627 6,8.03553741 C6.86341908,11.0817791 8.91250306,12.6975758 12.1472519,12.8829275 Z" id="Path-3" fill="#CB9494" transform="translate(9.073626, 10.454389) scale(-1, 1) translate(-9.073626, -10.454389) "></path>
                    <path d="M12.0748929,15.8455656 C11.1865664,12.4629011 9.13748246,10.8471044 5.92764097,10.9981756 C6.79106005,14.0444173 8.84014402,15.660214 12.0748929,15.8455656 Z" id="Path-3" fill="#DCABAB" transform="translate(9.001267, 13.417027) scale(-1, 1) rotate(6.000000) translate(-9.001267, -13.417027) "></path>
                    <path d="M9.64396738,19.9727193 C11.4601692,16.9839145 11.1990627,14.3875001 8.86064797,12.1834762 C7.26914634,14.9206653 7.53025281,17.5170796 9.64396738,19.9727193 Z" id="Path-3" fill="#CB9494" transform="translate(9.335077, 16.078098) scale(-1, 1) rotate(-50.000000) translate(-9.335077, -16.078098) "></path>
                </g>
                <g id="plant" transform="translate(335.500000, 11.000000) scale(-1, 1) translate(-335.500000, -11.000000) translate(328.000000, 0.000000)">
                    <path d="M5.16874947,9.64064121 C6.98495128,6.65183642 6.72384481,4.05542206 4.38543006,1.85139815 C2.79392843,4.58858718 3.0550349,7.18500154 5.16874947,9.64064121 Z" id="Path-3" fill="#DCABAB" transform="translate(4.859860, 5.746020) rotate(-33.000000) translate(-4.859860, -5.746020) "></path>
                    <path d="M5.359442,13.3570703 C7.17564381,10.3682655 6.91453735,7.77185117 4.5761226,5.56782726 C2.98462097,8.30501629 3.24572744,10.9014306 5.359442,13.3570703 Z" id="Path-3" fill="#CB9494" transform="translate(5.050552, 9.462449) rotate(-55.000000) translate(-5.050552, -9.462449) "></path>
                    <path d="M7.85955227,15.2675507 C6.97122582,11.8848862 4.92214184,10.2690895 1.71230035,10.4201607 C2.57571943,13.4664024 4.6248034,15.0821991 7.85955227,15.2675507 Z" id="Path-3" fill="#DCABAB"></path>
                    <path d="M7.85955227,18.2675507 C6.97122582,14.8848862 4.92214184,13.2690895 1.71230035,13.4201607 C2.57571943,16.4664024 4.6248034,18.0821991 7.85955227,18.2675507 Z" id="Path-3" fill="#CB9494"></path>
                    <path d="M5.349725,22.3461271 C7.16592681,19.3573223 6.90482034,16.760908 4.5664056,14.5568841 C2.97490396,17.2940731 3.23601043,19.8904875 5.349725,22.3461271 Z" id="Path-3" fill="#DCABAB" transform="translate(5.040835, 18.451506) rotate(-71.000000) translate(-5.040835, -18.451506) "></path>
                    <path d="M8.68791283,9.00363957 C10.5041146,6.01483477 10.2430082,3.41842042 7.90459343,1.2143965 C6.3130918,3.95158554 6.57419827,6.54799989 8.68791283,9.00363957 Z" id="Path-3" fill="#CB9494" transform="translate(8.379023, 5.109018) scale(-1, 1) rotate(-33.000000) translate(-8.379023, -5.109018) "></path>
                    <path d="M7.03973171,8.04808374 C8.85593352,5.05927894 8.59482706,2.46286459 6.25641231,0.258840674 C4.66491068,2.99602971 4.92601714,5.59244406 7.03973171,8.04808374 Z" id="Path-3" fill="#DCABAB" transform="translate(6.730842, 4.153462) scale(-1, 1) rotate(10.000000) translate(-6.730842, -4.153462) "></path>
                    <path d="M9.359442,11.38292 C11.1756438,8.39411525 10.9145373,5.79770089 8.5761226,3.59367698 C6.98462097,6.33086601 7.24572744,8.92728037 9.359442,11.38292 Z" id="Path-3" fill="#CB9494" transform="translate(9.050552, 7.488299) scale(-1, 1) rotate(-55.000000) translate(-9.050552, -7.488299) "></path>
                    <path d="M10.359442,22.3570703 C12.1756438,19.3682655 11.9145373,16.7718512 9.5761226,14.5678273 C7.98462097,17.3050163 8.24572744,19.9014306 10.359442,22.3570703 Z" id="Path-3" fill="#DCABAB" transform="translate(10.050552, 18.462449) scale(-1, 1) rotate(-55.000000) translate(-10.050552, -18.462449) "></path>
                    <path d="M12.1472519,12.8829275 C11.2589255,9.50026296 9.2098415,7.88446627 6,8.03553741 C6.86341908,11.0817791 8.91250306,12.6975758 12.1472519,12.8829275 Z" id="Path-3" fill="#DCABAB" transform="translate(9.073626, 10.454389) scale(-1, 1) translate(-9.073626, -10.454389) "></path>
                    <path d="M12.1472519,15.8829275 C11.2589255,12.500263 9.2098415,10.8844663 6,11.0355374 C6.86341908,14.0817791 8.91250306,15.6975758 12.1472519,15.8829275 Z" id="Path-3" fill="#DCABAB" transform="translate(9.073626, 13.454389) scale(-1, 1) translate(-9.073626, -13.454389) "></path>
                    <path d="M9.47962251,19.6065495 C11.2958243,16.6177447 11.0347179,14.0213303 8.69630311,11.8173064 C7.10480148,14.5544954 7.36590794,17.1509098 9.47962251,19.6065495 Z" id="Path-3" fill="#CB9494" transform="translate(9.170733, 15.711928) scale(-1, 1) rotate(-71.000000) translate(-9.170733, -15.711928) "></path>
                </g>
                <g id="plant" transform="translate(347.500000, 11.000000) scale(-1, 1) translate(-347.500000, -11.000000) translate(340.000000, 0.000000)">
                    <path d="M5.16874947,9.64064121 C6.98495128,6.65183642 6.72384481,4.05542206 4.38543006,1.85139815 C2.79392843,4.58858718 3.0550349,7.18500154 5.16874947,9.64064121 Z" id="Path-3" fill="#CB9494" transform="translate(4.859860, 5.746020) rotate(-33.000000) translate(-4.859860, -5.746020) "></path>
                    <path d="M5.359442,13.3570703 C7.17564381,10.3682655 6.91453735,7.77185117 4.5761226,5.56782726 C2.98462097,8.30501629 3.24572744,10.9014306 5.359442,13.3570703 Z" id="Path-3" fill="#DCABAB" transform="translate(5.050552, 9.462449) rotate(-40.000000) translate(-5.050552, -9.462449) "></path>
                    <path d="M7.85955227,15.2675507 C6.97122582,11.8848862 4.92214184,10.2690895 1.71230035,10.4201607 C2.57571943,13.4664024 4.6248034,15.0821991 7.85955227,15.2675507 Z" id="Path-3" fill="#CB9494"></path>
                    <path d="M8.48931767,18.3079995 C7.60099122,14.9253349 5.55190724,13.3095382 2.34206574,13.4606094 C3.20548483,16.5068511 5.2545688,18.1226478 8.48931767,18.3079995 Z" id="Path-3" fill="#DCABAB" transform="translate(5.415692, 15.879461) rotate(-9.000000) translate(-5.415692, -15.879461) "></path>
                    <path d="M5.349725,22.3461271 C7.16592681,19.3573223 6.90482034,16.760908 4.5664056,14.5568841 C2.97490396,17.2940731 3.23601043,19.8904875 5.349725,22.3461271 Z" id="Path-3" fill="#CB9494" transform="translate(5.040835, 18.451506) rotate(-71.000000) translate(-5.040835, -18.451506) "></path>
                    <path d="M8.68791283,9.00363957 C10.5041146,6.01483477 10.2430082,3.41842042 7.90459343,1.2143965 C6.3130918,3.95158554 6.57419827,6.54799989 8.68791283,9.00363957 Z" id="Path-3" fill="#CB9494" transform="translate(8.379023, 5.109018) scale(-1, 1) rotate(-33.000000) translate(-8.379023, -5.109018) "></path>
                    <path d="M7.03973171,8.04808374 C8.85593352,5.05927894 8.59482706,2.46286459 6.25641231,0.258840674 C4.66491068,2.99602971 4.92601714,5.59244406 7.03973171,8.04808374 Z" id="Path-3" fill="#DCABAB" transform="translate(6.730842, 4.153462) scale(-1, 1) rotate(10.000000) translate(-6.730842, -4.153462) "></path>
                    <path d="M9.359442,11.38292 C11.1756438,8.39411525 10.9145373,5.79770089 8.5761226,3.59367698 C6.98462097,6.33086601 7.24572744,8.92728037 9.359442,11.38292 Z" id="Path-3" fill="#DCABAB" transform="translate(9.050552, 7.488299) scale(-1, 1) rotate(-55.000000) translate(-9.050552, -7.488299) "></path>
                    <path d="M10.359442,22.3570703 C12.1756438,19.3682655 11.9145373,16.7718512 9.5761226,14.5678273 C7.98462097,17.3050163 8.24572744,19.9014306 10.359442,22.3570703 Z" id="Path-3" fill="#DCABAB" transform="translate(10.050552, 18.462449) scale(-1, 1) rotate(-55.000000) translate(-10.050552, -18.462449) "></path>
                    <path d="M12.1472519,12.8829275 C11.2589255,9.50026296 9.2098415,7.88446627 6,8.03553741 C6.86341908,11.0817791 8.91250306,12.6975758 12.1472519,12.8829275 Z" id="Path-3" fill="#CB9494" transform="translate(9.073626, 10.454389) scale(-1, 1) translate(-9.073626, -10.454389) "></path>
                    <path d="M12.0748929,15.8455656 C11.1865664,12.4629011 9.13748246,10.8471044 5.92764097,10.9981756 C6.79106005,14.0444173 8.84014402,15.660214 12.0748929,15.8455656 Z" id="Path-3" fill="#DCABAB" transform="translate(9.001267, 13.417027) scale(-1, 1) rotate(6.000000) translate(-9.001267, -13.417027) "></path>
                    <path d="M9.64396738,19.9727193 C11.4601692,16.9839145 11.1990627,14.3875001 8.86064797,12.1834762 C7.26914634,14.9206653 7.53025281,17.5170796 9.64396738,19.9727193 Z" id="Path-3" fill="#CB9494" transform="translate(9.335077, 16.078098) scale(-1, 1) rotate(-50.000000) translate(-9.335077, -16.078098) "></path>
                </g>
                <g id="plant" transform="translate(335.500000, 30.000000) scale(-1, 1) translate(-335.500000, -30.000000) translate(328.000000, 19.000000)">
                    <path d="M5.16874947,9.64064121 C6.98495128,6.65183642 6.72384481,4.05542206 4.38543006,1.85139815 C2.79392843,4.58858718 3.0550349,7.18500154 5.16874947,9.64064121 Z" id="Path-3" fill="#DCABAB" transform="translate(4.859860, 5.746020) rotate(-33.000000) translate(-4.859860, -5.746020) "></path>
                    <path d="M5.359442,13.3570703 C7.17564381,10.3682655 6.91453735,7.77185117 4.5761226,5.56782726 C2.98462097,8.30501629 3.24572744,10.9014306 5.359442,13.3570703 Z" id="Path-3" fill="#CB9494" transform="translate(5.050552, 9.462449) rotate(-55.000000) translate(-5.050552, -9.462449) "></path>
                    <path d="M7.85955227,15.2675507 C6.97122582,11.8848862 4.92214184,10.2690895 1.71230035,10.4201607 C2.57571943,13.4664024 4.6248034,15.0821991 7.85955227,15.2675507 Z" id="Path-3" fill="#DCABAB"></path>
                    <path d="M7.85955227,18.2675507 C6.97122582,14.8848862 4.92214184,13.2690895 1.71230035,13.4201607 C2.57571943,16.4664024 4.6248034,18.0821991 7.85955227,18.2675507 Z" id="Path-3" fill="#CB9494"></path>
                    <path d="M5.349725,22.3461271 C7.16592681,19.3573223 6.90482034,16.760908 4.5664056,14.5568841 C2.97490396,17.2940731 3.23601043,19.8904875 5.349725,22.3461271 Z" id="Path-3" fill="#DCABAB" transform="translate(5.040835, 18.451506) rotate(-71.000000) translate(-5.040835, -18.451506) "></path>
                    <path d="M8.68791283,9.00363957 C10.5041146,6.01483477 10.2430082,3.41842042 7.90459343,1.2143965 C6.3130918,3.95158554 6.57419827,6.54799989 8.68791283,9.00363957 Z" id="Path-3" fill="#CB9494" transform="translate(8.379023, 5.109018) scale(-1, 1) rotate(-33.000000) translate(-8.379023, -5.109018) "></path>
                    <path d="M7.03973171,8.04808374 C8.85593352,5.05927894 8.59482706,2.46286459 6.25641231,0.258840674 C4.66491068,2.99602971 4.92601714,5.59244406 7.03973171,8.04808374 Z" id="Path-3" fill="#DCABAB" transform="translate(6.730842, 4.153462) scale(-1, 1) rotate(10.000000) translate(-6.730842, -4.153462) "></path>
                    <path d="M9.359442,11.38292 C11.1756438,8.39411525 10.9145373,5.79770089 8.5761226,3.59367698 C6.98462097,6.33086601 7.24572744,8.92728037 9.359442,11.38292 Z" id="Path-3" fill="#CB9494" transform="translate(9.050552, 7.488299) scale(-1, 1) rotate(-55.000000) translate(-9.050552, -7.488299) "></path>
                    <path d="M10.359442,22.3570703 C12.1756438,19.3682655 11.9145373,16.7718512 9.5761226,14.5678273 C7.98462097,17.3050163 8.24572744,19.9014306 10.359442,22.3570703 Z" id="Path-3" fill="#DCABAB" transform="translate(10.050552, 18.462449) scale(-1, 1) rotate(-55.000000) translate(-10.050552, -18.462449) "></path>
                    <path d="M12.1472519,12.8829275 C11.2589255,9.50026296 9.2098415,7.88446627 6,8.03553741 C6.86341908,11.0817791 8.91250306,12.6975758 12.1472519,12.8829275 Z" id="Path-3" fill="#DCABAB" transform="translate(9.073626, 10.454389) scale(-1, 1) translate(-9.073626, -10.454389) "></path>
                    <path d="M12.1472519,15.8829275 C11.2589255,12.500263 9.2098415,10.8844663 6,11.0355374 C6.86341908,14.0817791 8.91250306,15.6975758 12.1472519,15.8829275 Z" id="Path-3" fill="#DCABAB" transform="translate(9.073626, 13.454389) scale(-1, 1) translate(-9.073626, -13.454389) "></path>
                    <path d="M9.47962251,19.6065495 C11.2958243,16.6177447 11.0347179,14.0213303 8.69630311,11.8173064 C7.10480148,14.5544954 7.36590794,17.1509098 9.47962251,19.6065495 Z" id="Path-3" fill="#CB9494" transform="translate(9.170733, 15.711928) scale(-1, 1) rotate(-71.000000) translate(-9.170733, -15.711928) "></path>
                </g>
                <g id="plant" transform="translate(347.500000, 30.000000) scale(-1, 1) translate(-347.500000, -30.000000) translate(340.000000, 19.000000)">
                    <path d="M5.16874947,9.64064121 C6.98495128,6.65183642 6.72384481,4.05542206 4.38543006,1.85139815 C2.79392843,4.58858718 3.0550349,7.18500154 5.16874947,9.64064121 Z" id="Path-3" fill="#CB9494" transform="translate(4.859860, 5.746020) rotate(-33.000000) translate(-4.859860, -5.746020) "></path>
                    <path d="M5.359442,13.3570703 C7.17564381,10.3682655 6.91453735,7.77185117 4.5761226,5.56782726 C2.98462097,8.30501629 3.24572744,10.9014306 5.359442,13.3570703 Z" id="Path-3" fill="#DCABAB" transform="translate(5.050552, 9.462449) rotate(-40.000000) translate(-5.050552, -9.462449) "></path>
                    <path d="M7.85955227,15.2675507 C6.97122582,11.8848862 4.92214184,10.2690895 1.71230035,10.4201607 C2.57571943,13.4664024 4.6248034,15.0821991 7.85955227,15.2675507 Z" id="Path-3" fill="#CB9494"></path>
                    <path d="M8.48931767,18.3079995 C7.60099122,14.9253349 5.55190724,13.3095382 2.34206574,13.4606094 C3.20548483,16.5068511 5.2545688,18.1226478 8.48931767,18.3079995 Z" id="Path-3" fill="#DCABAB" transform="translate(5.415692, 15.879461) rotate(-9.000000) translate(-5.415692, -15.879461) "></path>
                    <path d="M5.349725,22.3461271 C7.16592681,19.3573223 6.90482034,16.760908 4.5664056,14.5568841 C2.97490396,17.2940731 3.23601043,19.8904875 5.349725,22.3461271 Z" id="Path-3" fill="#CB9494" transform="translate(5.040835, 18.451506) rotate(-71.000000) translate(-5.040835, -18.451506) "></path>
                    <path d="M8.68791283,9.00363957 C10.5041146,6.01483477 10.2430082,3.41842042 7.90459343,1.2143965 C6.3130918,3.95158554 6.57419827,6.54799989 8.68791283,9.00363957 Z" id="Path-3" fill="#CB9494" transform="translate(8.379023, 5.109018) scale(-1, 1) rotate(-33.000000) translate(-8.379023, -5.109018) "></path>
                    <path d="M7.03973171,8.04808374 C8.85593352,5.05927894 8.59482706,2.46286459 6.25641231,0.258840674 C4.66491068,2.99602971 4.92601714,5.59244406 7.03973171,8.04808374 Z" id="Path-3" fill="#DCABAB" transform="translate(6.730842, 4.153462) scale(-1, 1) rotate(10.000000) translate(-6.730842, -4.153462) "></path>
                    <path d="M9.359442,11.38292 C11.1756438,8.39411525 10.9145373,5.79770089 8.5761226,3.59367698 C6.98462097,6.33086601 7.24572744,8.92728037 9.359442,11.38292 Z" id="Path-3" fill="#DCABAB" transform="translate(9.050552, 7.488299) scale(-1, 1) rotate(-55.000000) translate(-9.050552, -7.488299) "></path>
                    <path d="M10.359442,22.3570703 C12.1756438,19.3682655 11.9145373,16.7718512 9.5761226,14.5678273 C7.98462097,17.3050163 8.24572744,19.9014306 10.359442,22.3570703 Z" id="Path-3" fill="#DCABAB" transform="translate(10.050552, 18.462449) scale(-1, 1) rotate(-55.000000) translate(-10.050552, -18.462449) "></path>
                    <path d="M12.1472519,12.8829275 C11.2589255,9.50026296 9.2098415,7.88446627 6,8.03553741 C6.86341908,11.0817791 8.91250306,12.6975758 12.1472519,12.8829275 Z" id="Path-3" fill="#CB9494" transform="translate(9.073626, 10.454389) scale(-1, 1) translate(-9.073626, -10.454389) "></path>
                    <path d="M12.0748929,15.8455656 C11.1865664,12.4629011 9.13748246,10.8471044 5.92764097,10.9981756 C6.79106005,14.0444173 8.84014402,15.660214 12.0748929,15.8455656 Z" id="Path-3" fill="#DCABAB" transform="translate(9.001267, 13.417027) scale(-1, 1) rotate(6.000000) translate(-9.001267, -13.417027) "></path>
                    <path d="M9.64396738,19.9727193 C11.4601692,16.9839145 11.1990627,14.3875001 8.86064797,12.1834762 C7.26914634,14.9206653 7.53025281,17.5170796 9.64396738,19.9727193 Z" id="Path-3" fill="#CB9494" transform="translate(9.335077, 16.078098) scale(-1, 1) rotate(-50.000000) translate(-9.335077, -16.078098) "></path>
                </g>
                <g id="plant" transform="translate(335.500000, 49.000000) scale(-1, 1) translate(-335.500000, -49.000000) translate(328.000000, 38.000000)">
                    <path d="M5.16874947,9.64064121 C6.98495128,6.65183642 6.72384481,4.05542206 4.38543006,1.85139815 C2.79392843,4.58858718 3.0550349,7.18500154 5.16874947,9.64064121 Z" id="Path-3" fill="#DCABAB" transform="translate(4.859860, 5.746020) rotate(-33.000000) translate(-4.859860, -5.746020) "></path>
                    <path d="M5.359442,13.3570703 C7.17564381,10.3682655 6.91453735,7.77185117 4.5761226,5.56782726 C2.98462097,8.30501629 3.24572744,10.9014306 5.359442,13.3570703 Z" id="Path-3" fill="#CB9494" transform="translate(5.050552, 9.462449) rotate(-55.000000) translate(-5.050552, -9.462449) "></path>
                    <path d="M7.85955227,15.2675507 C6.97122582,11.8848862 4.92214184,10.2690895 1.71230035,10.4201607 C2.57571943,13.4664024 4.6248034,15.0821991 7.85955227,15.2675507 Z" id="Path-3" fill="#DCABAB"></path>
                    <path d="M7.85955227,18.2675507 C6.97122582,14.8848862 4.92214184,13.2690895 1.71230035,13.4201607 C2.57571943,16.4664024 4.6248034,18.0821991 7.85955227,18.2675507 Z" id="Path-3" fill="#CB9494"></path>
                    <path d="M5.349725,22.3461271 C7.16592681,19.3573223 6.90482034,16.760908 4.5664056,14.5568841 C2.97490396,17.2940731 3.23601043,19.8904875 5.349725,22.3461271 Z" id="Path-3" fill="#DCABAB" transform="translate(5.040835, 18.451506) rotate(-71.000000) translate(-5.040835, -18.451506) "></path>
                    <path d="M8.68791283,9.00363957 C10.5041146,6.01483477 10.2430082,3.41842042 7.90459343,1.2143965 C6.3130918,3.95158554 6.57419827,6.54799989 8.68791283,9.00363957 Z" id="Path-3" fill="#CB9494" transform="translate(8.379023, 5.109018) scale(-1, 1) rotate(-33.000000) translate(-8.379023, -5.109018) "></path>
                    <path d="M7.03973171,8.04808374 C8.85593352,5.05927894 8.59482706,2.46286459 6.25641231,0.258840674 C4.66491068,2.99602971 4.92601714,5.59244406 7.03973171,8.04808374 Z" id="Path-3" fill="#DCABAB" transform="translate(6.730842, 4.153462) scale(-1, 1) rotate(10.000000) translate(-6.730842, -4.153462) "></path>
                    <path d="M9.359442,11.38292 C11.1756438,8.39411525 10.9145373,5.79770089 8.5761226,3.59367698 C6.98462097,6.33086601 7.24572744,8.92728037 9.359442,11.38292 Z" id="Path-3" fill="#CB9494" transform="translate(9.050552, 7.488299) scale(-1, 1) rotate(-55.000000) translate(-9.050552, -7.488299) "></path>
                    <path d="M10.359442,22.3570703 C12.1756438,19.3682655 11.9145373,16.7718512 9.5761226,14.5678273 C7.98462097,17.3050163 8.24572744,19.9014306 10.359442,22.3570703 Z" id="Path-3" fill="#DCABAB" transform="translate(10.050552, 18.462449) scale(-1, 1) rotate(-55.000000) translate(-10.050552, -18.462449) "></path>
                    <path d="M12.1472519,12.8829275 C11.2589255,9.50026296 9.2098415,7.88446627 6,8.03553741 C6.86341908,11.0817791 8.91250306,12.6975758 12.1472519,12.8829275 Z" id="Path-3" fill="#DCABAB" transform="translate(9.073626, 10.454389) scale(-1, 1) translate(-9.073626, -10.454389) "></path>
                    <path d="M12.1472519,15.8829275 C11.2589255,12.500263 9.2098415,10.8844663 6,11.0355374 C6.86341908,14.0817791 8.91250306,15.6975758 12.1472519,15.8829275 Z" id="Path-3" fill="#DCABAB" transform="translate(9.073626, 13.454389) scale(-1, 1) translate(-9.073626, -13.454389) "></path>
                    <path d="M9.47962251,19.6065495 C11.2958243,16.6177447 11.0347179,14.0213303 8.69630311,11.8173064 C7.10480148,14.5544954 7.36590794,17.1509098 9.47962251,19.6065495 Z" id="Path-3" fill="#CB9494" transform="translate(9.170733, 15.711928) scale(-1, 1) rotate(-71.000000) translate(-9.170733, -15.711928) "></path>
                </g>
                <g id="plant" transform="translate(347.500000, 49.000000) scale(-1, 1) translate(-347.500000, -49.000000) translate(340.000000, 38.000000)">
                    <path d="M5.16874947,9.64064121 C6.98495128,6.65183642 6.72384481,4.05542206 4.38543006,1.85139815 C2.79392843,4.58858718 3.0550349,7.18500154 5.16874947,9.64064121 Z" id="Path-3" fill="#CB9494" transform="translate(4.859860, 5.746020) rotate(-33.000000) translate(-4.859860, -5.746020) "></path>
                    <path d="M5.359442,13.3570703 C7.17564381,10.3682655 6.91453735,7.77185117 4.5761226,5.56782726 C2.98462097,8.30501629 3.24572744,10.9014306 5.359442,13.3570703 Z" id="Path-3" fill="#DCABAB" transform="translate(5.050552, 9.462449) rotate(-40.000000) translate(-5.050552, -9.462449) "></path>
                    <path d="M7.85955227,15.2675507 C6.97122582,11.8848862 4.92214184,10.2690895 1.71230035,10.4201607 C2.57571943,13.4664024 4.6248034,15.0821991 7.85955227,15.2675507 Z" id="Path-3" fill="#CB9494"></path>
                    <path d="M8.48931767,18.3079995 C7.60099122,14.9253349 5.55190724,13.3095382 2.34206574,13.4606094 C3.20548483,16.5068511 5.2545688,18.1226478 8.48931767,18.3079995 Z" id="Path-3" fill="#DCABAB" transform="translate(5.415692, 15.879461) rotate(-9.000000) translate(-5.415692, -15.879461) "></path>
                    <path d="M5.349725,22.3461271 C7.16592681,19.3573223 6.90482034,16.760908 4.5664056,14.5568841 C2.97490396,17.2940731 3.23601043,19.8904875 5.349725,22.3461271 Z" id="Path-3" fill="#CB9494" transform="translate(5.040835, 18.451506) rotate(-71.000000) translate(-5.040835, -18.451506) "></path>
                    <path d="M8.68791283,9.00363957 C10.5041146,6.01483477 10.2430082,3.41842042 7.90459343,1.2143965 C6.3130918,3.95158554 6.57419827,6.54799989 8.68791283,9.00363957 Z" id="Path-3" fill="#CB9494" transform="translate(8.379023, 5.109018) scale(-1, 1) rotate(-33.000000) translate(-8.379023, -5.109018) "></path>
                    <path d="M7.03973171,8.04808374 C8.85593352,5.05927894 8.59482706,2.46286459 6.25641231,0.258840674 C4.66491068,2.99602971 4.92601714,5.59244406 7.03973171,8.04808374 Z" id="Path-3" fill="#DCABAB" transform="translate(6.730842, 4.153462) scale(-1, 1) rotate(10.000000) translate(-6.730842, -4.153462) "></path>
                    <path d="M9.359442,11.38292 C11.1756438,8.39411525 10.9145373,5.79770089 8.5761226,3.59367698 C6.98462097,6.33086601 7.24572744,8.92728037 9.359442,11.38292 Z" id="Path-3" fill="#DCABAB" transform="translate(9.050552, 7.488299) scale(-1, 1) rotate(-55.000000) translate(-9.050552, -7.488299) "></path>
                    <path d="M10.359442,22.3570703 C12.1756438,19.3682655 11.9145373,16.7718512 9.5761226,14.5678273 C7.98462097,17.3050163 8.24572744,19.9014306 10.359442,22.3570703 Z" id="Path-3" fill="#DCABAB" transform="translate(10.050552, 18.462449) scale(-1, 1) rotate(-55.000000) translate(-10.050552, -18.462449) "></path>
                    <path d="M12.1472519,12.8829275 C11.2589255,9.50026296 9.2098415,7.88446627 6,8.03553741 C6.86341908,11.0817791 8.91250306,12.6975758 12.1472519,12.8829275 Z" id="Path-3" fill="#CB9494" transform="translate(9.073626, 10.454389) scale(-1, 1) translate(-9.073626, -10.454389) "></path>
                    <path d="M12.0748929,15.8455656 C11.1865664,12.4629011 9.13748246,10.8471044 5.92764097,10.9981756 C6.79106005,14.0444173 8.84014402,15.660214 12.0748929,15.8455656 Z" id="Path-3" fill="#DCABAB" transform="translate(9.001267, 13.417027) scale(-1, 1) rotate(6.000000) translate(-9.001267, -13.417027) "></path>
                    <path d="M9.64396738,19.9727193 C11.4601692,16.9839145 11.1990627,14.3875001 8.86064797,12.1834762 C7.26914634,14.9206653 7.53025281,17.5170796 9.64396738,19.9727193 Z" id="Path-3" fill="#CB9494" transform="translate(9.335077, 16.078098) scale(-1, 1) rotate(-50.000000) translate(-9.335077, -16.078098) "></path>
                </g>
                <rect id="Bg" fill="#9E9791" x="4" y="39" width="347" height="2"></rect>
                <rect id="Bg" fill="#9E9791" x="4" y="20" width="347" height="2"></rect>
            </g>
        </g>
    </g>
</svg>