<?xml version="1.0" encoding="UTF-8" standalone="no"?>
<svg width="375px" height="61px" viewBox="0 0 375 61" version="1.1" xmlns="http://www.w3.org/2000/svg" xmlns:xlink="http://www.w3.org/1999/xlink">
    <!-- Generator: Sketch 49.3 (51167) - http://www.bohemiancoding.com/sketch -->
    <title>top</title>
    <desc>Created with Sketch.</desc>
    <defs></defs>
    <g id="高雄左營店" stroke="none" stroke-width="1" fill="none" fill-rule="evenodd">
        <g id="two" transform="translate(0.000000, -322.000000)">
            <g id="top" transform="translate(8.000000, 358.000000)">
                <rect id="Bg" fill="#E2E6EE" x="300" y="0" width="59" height="25"></rect>
                <rect id="Bg" fill="#E2E6EE" x="0" y="0" width="59" height="25"></rect>
                <g id="lines" fill="#CAD1DD" fill-rule="nonzero">
                    <polygon id="Line" points="349 0 349 25 350 25 350 0"></polygon>
                    <polygon id="Line-Copy" points="339 0 339 25 340 25 340 0"></polygon>
                    <polygon id="Line-Copy" points="10 0 10 25 9 25 9 0"></polygon>
                    <polygon id="Line-Copy" points="20 0 20 25 19 25 19 0"></polygon>
                    <polygon id="Line-Copy" points="30 0 30 25 29 25 29 0"></polygon>
                    <polygon id="Line-Copy-2" points="40 0 40 25 39 25 39 0"></polygon>
                    <polygon id="Line-Copy-3" points="50 0 50 25 49 25 49 0"></polygon>
                    <polygon id="Line-Copy" points="310 0 310 25 309 25 309 0"></polygon>
                    <polygon id="Line-Copy-2" points="320 0 320 25 319 25 319 0"></polygon>
                    <polygon id="Line-Copy-3" points="330 0 330 25 329 25 329 0"></polygon>
                    <polygon id="Line-2-Copy-3" points="359 23 -2.84217094e-14 23 -2.84217094e-14 22 359 22"></polygon>
                </g>
            </g>
            <g id="floor-layer" transform="translate(33.000000, 378.000000)" fill="#CAD1DD">
                <rect id="Rectangle-17-Copy-5" x="0" y="0" width="309" height="5"></rect>
            </g>
        </g>
    </g>
</svg>