<?xml version="1.0" encoding="UTF-8" standalone="no"?>
<svg width="33px" height="61px" viewBox="0 0 33 61" version="1.1" xmlns="http://www.w3.org/2000/svg" xmlns:xlink="http://www.w3.org/1999/xlink">
    <!-- Generator: Sketch 48.2 (47327) - http://www.bohemiancoding.com/sketch -->
    <title>6桃園大有</title>
    <desc>Created with Sketch.</desc>
    <defs></defs>
    <g id="桃園大有" stroke="none" stroke-width="1" fill="none" fill-rule="evenodd" transform="translate(0.000000, -368.000000)">
        <g id="Group-Copy-12" transform="translate(11.000000, 368.000000)">
            <g id="4F" fill="#F3F4F5">
                <rect id="window2" x="0" y="0" width="22" height="61"></rect>
            </g>
            <rect id="Bg2-Copy-8" fill="#9DA6B9" x="0" y="29" width="22" height="1"></rect>
            <rect id="Bg2-Copy-13" fill="#9DA6B9" x="0" y="60" width="22" height="1"></rect>
            <rect id="Bg2-Copy-12" fill="#9DA6B9" x="0" y="44" width="22" height="1"></rect>
            <rect id="Bg2-Copy-9" fill="#9DA6B9" x="0" y="14" width="22" height="1"></rect>
        </g>
    </g>
</svg>