<svg xmlns="http://www.w3.org/2000/svg" width="375" height="166" viewBox="0 0 375 166">
  <g fill="none" fill-rule="evenodd" transform="translate(0 -56)">
    <rect width="344.599" height="240" x="15.201" y="160" fill="#CAD1DD"/>
    <rect width="344.599" height="6" x="15.201" y="216" fill="#70778B"/>
    <rect width="344.599" height="6" x="15.201" y="154" fill="#70778B"/>
    <g transform="translate(20 160)">
      <g fill="#F0F2F7" transform="translate(0 5)">
        <rect width="335" height="2"/>
        <rect width="335" height="2" y="11"/>
        <rect width="335" height="2" y="22"/>
        <rect width="335" height="2" y="33"/>
        <rect width="335" height="2" y="44"/>
      </g>
      <rect width="9" height="56" fill="#E1F2FB"/>
      <rect width="2" height="56" fill="#F6F9FC"/>
      <rect width="4" height="56" x="9" fill="#000000" fill-opacity=".1"/>
      <rect width="4" height="56" x="81" fill="#000000" fill-opacity=".1"/>
      <rect width="4" height="56" x="152" fill="#000000" fill-opacity=".1"/>
      <rect width="4" height="56" x="224" fill="#000000" fill-opacity=".1"/>
      <rect width="4" height="56" x="295" fill="#000000" fill-opacity=".1"/>
      <rect width="41" height="56" x="111" fill="#E1F2FB"/>
      <rect width="41" height="56" x="183" fill="#E1F2FB"/>
      <rect width="41" height="56" x="254" fill="#E1F2FB"/>
      <rect width="9" height="56" x="326" fill="#E1F2FB"/>
      <g fill="#E1F2FB" transform="translate(40)">
        <rect width="41" height="56"/>
      </g>
      <rect width="2" height="56" x="40" fill="#F6F9FC"/>
      <rect width="2" height="56" x="111" fill="#F6F9FC"/>
      <rect width="2" height="56" x="182" fill="#F6F9FC"/>
      <rect width="2" height="56" x="253" fill="#F6F9FC"/>
      <rect width="2" height="56" x="326" fill="#F6F9FC"/>
    </g>
    <g transform="translate(16 56)">
      <g transform="translate(12 33)">
        <rect width="316" height="43" x="2" y="22" fill="#E2E6EE"/>
        <rect width="316" height="18" x="2" y="4" fill="#9DA6B9"/>
        <rect width="321" height="4" fill="#CAD1DD"/>
      </g>
      <g fill="#F3F4F5" transform="translate(17 55)">
        <rect width="2" height="43"/>
        <rect width="2" height="43" x="22"/>
        <rect width="2" height="43" x="44"/>
        <rect width="2" height="43" x="66"/>
        <rect width="2" height="43" x="88"/>
        <rect width="2" height="43" x="110"/>
        <rect width="2" height="43" x="132"/>
        <rect width="2" height="43" x="154"/>
        <rect width="2" height="43" x="176"/>
        <rect width="2" height="43" x="198"/>
        <rect width="2" height="43" x="220"/>
        <rect width="2" height="43" x="242"/>
        <rect width="2" height="43" x="264"/>
        <rect width="2" height="43" x="286"/>
        <rect width="2" height="43" x="308"/>
      </g>
      <rect width="344" height="12" y="6" fill="#4F5564"/>
      <polygon fill="#70778B" points="5.26 0 338.74 0 344 6 0 6"/>
      <g fill="#9DA6B9" transform="translate(13 57)">
        <rect width="318" height="2" y="14"/>
        <rect width="318" height="2" y="7"/>
        <rect width="318" height="2"/>
        <rect width="318" height="2" y="21"/>
        <rect width="318" height="2" y="28"/>
        <rect width="318" height="2" y="35"/>
      </g>
      <g fill="#E2E6EE" transform="translate(14 18)">
        <rect width="316" height="2"/>
        <rect width="316" height="2" y="5"/>
        <rect width="316" height="2" y="10"/>
        <g>
          <rect width="2" height="15" x="314"/>
          <rect width="2" height="15" x="300"/>
          <rect width="2" height="15" x="285"/>
          <rect width="2" height="15" x="271"/>
          <rect width="2" height="15" x="257"/>
          <rect width="2" height="15" x="243"/>
          <rect width="2" height="15" x="228"/>
          <rect width="2" height="15" x="214"/>
          <rect width="2" height="15" x="200"/>
          <rect width="2" height="15" x="185"/>
          <rect width="2" height="15" x="171"/>
          <rect width="2" height="15" x="157"/>
          <rect width="2" height="15" x="143"/>
          <rect width="2" height="15" x="128"/>
          <rect width="2" height="15" x="114"/>
          <rect width="2" height="15" x="100"/>
          <rect width="2" height="15" x="85"/>
          <rect width="2" height="15" x="71"/>
          <rect width="2" height="15" x="57"/>
          <rect width="2" height="15" x="43"/>
          <rect width="2" height="15" x="28"/>
          <rect width="2" height="15" x="14"/>
          <rect width="1.76" height="15"/>
        </g>
      </g>
    </g>
  </g>
</svg>
