<?xml version="1.0" encoding="UTF-8" standalone="no"?>
<svg width="375px" height="39px" viewBox="0 0 375 39" version="1.1" xmlns="http://www.w3.org/2000/svg" xmlns:xlink="http://www.w3.org/1999/xlink">
    <!-- Generator: Sketch 48.2 (47327) - http://www.bohemiancoding.com/sketch -->
    <title>A-top</title>
    <desc>Created with Sketch.</desc>
    <defs></defs>
    <g id="A" stroke="none" stroke-width="1" fill="none" fill-rule="evenodd" transform="translate(0.000000, -30.000000)">
        <g id="top" transform="translate(11.000000, 30.000000)">
            <rect id="wall" fill="#E2E6EE" x="0" y="29" width="353" height="10"></rect>
            <rect id="wall" fill="#E2E6EE" x="0" y="0" width="353" height="10"></rect>
            <g id="Group" transform="translate(40.000000, 10.000000)" fill="#CAD1DD">
                <rect id="Rectangle" x="0" y="0" width="3" height="19"></rect>
                <rect id="Rectangle" x="54" y="0" width="3" height="19"></rect>
                <rect id="Rectangle" x="108" y="0" width="3" height="19"></rect>
                <rect id="Rectangle" x="162" y="0" width="3" height="19"></rect>
                <rect id="Rectangle" x="216" y="0" width="3" height="19"></rect>
                <rect id="Rectangle" x="270" y="0" width="3" height="19"></rect>
            </g>
        </g>
        <g id="floor-layer" transform="translate(33.000000, 64.000000)" fill="#CAD1DD">
            <rect id="Rectangle-17-Copy-7" x="0" y="0" width="309" height="5"></rect>
        </g>
    </g>
</svg>