<?xml version="1.0" encoding="utf-8"?>
<!-- Generator: Adobe Illustrator 24.0.1, SVG Export Plug-In . SVG Version: 6.00 Build 0)  -->
<svg version="1.1" id="圖層_1" xmlns="http://www.w3.org/2000/svg" xmlns:xlink="http://www.w3.org/1999/xlink" x="0px" y="0px"
	 viewBox="0 0 481.2 580.7" style="enable-background:new 0 0 481.2 580.7;" xml:space="preserve">
<style type="text/css">
	.st0{fill:#DE0716;}
	.st1{fill:#FFFFFF;}
</style>
<g>
	<polygon class="st0" points="289.9,563.7 289.9,546.7 272.9,546.7 255.9,546.7 255.9,563.7 255.9,580.7 272.9,580.7 289.9,580.7 	
		"/>
	<path class="st0" d="M452.6,290.2c-13.8-10.4-26.3-14.5-44.4-14.5h-11.3v17v17h10c7.6,0,11.2,0.5,15.4,2.1
		c6.9,2.5,14.9,9.6,18.4,16.3c2.4,4.5,2.7,6.2,2.7,15.1c0,8.5-0.3,10.7-2.4,14.8c-4.9,9.9-14.6,16.9-26,18.8
		c-3.2,0.5-73.1,0.9-164.6,0.9c-151.1,0-159.4,0.1-168,1.9c-36.4,7.5-65.5,33.9-76.8,69.6c-17.8,56.6,17.9,117.2,76.3,129.6
		c7.7,1.6,15,1.8,74.3,1.8l65.7,0.1l-0.2-16.7l-0.3-16.8l-66.5-0.5l-66.5-0.5l-7.3-2.8c-10.9-4.2-18.8-9.3-26.1-16.6
		c-7.9-7.9-13.2-16.7-16.8-27.6c-2.2-6.8-2.6-9.7-2.6-20s0.4-13.2,2.6-20c6.9-20.8,21.3-35.8,42.1-43.9l8.1-3.1l166.5-0.5
		c185.6-0.6,169.9,0,185.5-7.5c17.7-8.6,31.1-25,36.2-44.5c2.2-8.5,2.2-24.3-0.1-33C472.7,312.2,463.8,298.6,452.6,290.2z"/>
	<polygon class="st0" points="357.9,563.7 357.9,546.7 340.9,546.7 323.9,546.7 323.9,563.7 323.9,580.7 340.9,580.7 357.9,580.7 	
		"/>
	<polygon class="st0" points="330.9,292.7 330.9,309.7 347.9,309.7 364.9,309.7 364.9,292.7 364.9,275.7 347.9,275.7 330.9,275.7 	
		"/>
	<g>
		<path class="st0" d="M281.3,59.2c-32.8-15.5-73,3.9-82,39.5c-2.4,9.5-1.5,25.3,1.9,34.2c9.4,24.6,32.9,39.8,58.8,38.2
			c4.2-0.2,10-1.1,13-2c20.9-6.2,36.9-23.6,41.4-44.9c1.9-9,1.9-13.8-0.1-23.3C310.5,82.6,298.4,67.3,281.3,59.2z"/>
		<path class="st0" d="M306.5,11.7c-67.8-32.9-147.3,6.9-161.2,80.9c-7,37.1,7.4,80.5,46,139.1c18.1,27.5,52.4,71.2,58.4,74.5
			c4.1,2.2,10.4,1.9,14.3-0.8c4.2-2.8,21.6-23.6,36.4-43.2c36.3-48.5,58.9-91.1,66.6-125.4C378.3,86.3,353.3,34.4,306.5,11.7z
			 M295.9,219.7c-9,13.4-29.6,41.1-35.7,47.9l-3.9,4.4l-10.6-13.4c-39.6-50.5-64.4-94.6-71.9-127.9c-2.2-10.2-2.5-25.7-0.5-35.1
			c6.7-31.3,30.8-56.6,62.2-65c11.2-3,30.6-3,41.9,0c35,9.4,59,37,63.6,73.2C344.6,131.3,329.9,168.9,295.9,219.7z"/>
	</g>
	<path class="st1" d="M249.1,142.2c-6.7-1.9-8.4-2.8-13.4-7.3c-12.3-11.1-13-30.2-1.7-42.7c6.6-7.2,13-10,22.9-9.9
		c12.4,0.1,21.6,5.8,27.1,17c2.6,5.3,3.2,7.6,3.2,13.3C287.2,132.5,268,147.4,249.1,142.2z"/>
</g>
</svg>
