<?xml version="1.0" encoding="UTF-8" standalone="no"?>
<svg width="375px" height="478px" viewBox="0 0 375 478" version="1.1" xmlns="http://www.w3.org/2000/svg" xmlns:xlink="http://www.w3.org/1999/xlink">
    <!-- Generator: Sketch 47.1 (45422) - http://www.bohemiancoding.com/sketch -->
    <title>8F</title>
    <desc>Created with Sketch.</desc>
    <defs>
        <rect id="path-1" x="0" y="0" width="18" height="47"></rect>
        <rect id="path-2" x="17" y="0" width="18" height="47"></rect>
        <rect id="path-3" x="51" y="0" width="18" height="47"></rect>
        <rect id="path-4" x="34" y="0" width="18" height="47"></rect>
        <rect id="path-5" x="68" y="0" width="18" height="47"></rect>
        <rect id="path-6" x="0" y="0" width="18" height="47"></rect>
        <rect id="path-7" x="34" y="0" width="18" height="47"></rect>
        <rect id="path-8" x="17" y="0" width="18" height="47"></rect>
        <rect id="path-9" x="0" y="0" width="18" height="47"></rect>
        <rect id="path-10" x="17" y="0" width="18" height="47"></rect>
        <rect id="path-11" x="51" y="0" width="18" height="47"></rect>
        <rect id="path-12" x="34" y="0" width="18" height="47"></rect>
        <rect id="path-13" x="68" y="0" width="18" height="47"></rect>
        <rect id="path-14" x="0" y="0" width="18" height="47"></rect>
        <rect id="path-15" x="17" y="0" width="18" height="47"></rect>
        <rect id="path-16" x="51" y="0" width="18" height="47"></rect>
        <rect id="path-17" x="34" y="0" width="18" height="47"></rect>
        <rect id="path-18" x="68" y="0" width="18" height="47"></rect>
        <rect id="path-19" x="0" y="0" width="18" height="47"></rect>
        <rect id="path-20" x="34" y="0" width="18" height="47"></rect>
        <rect id="path-21" x="17" y="0" width="18" height="47"></rect>
        <rect id="path-22" x="0" y="0" width="18" height="47"></rect>
        <rect id="path-23" x="17" y="0" width="18" height="47"></rect>
        <rect id="path-24" x="51" y="0" width="18" height="47"></rect>
        <rect id="path-25" x="34" y="0" width="18" height="47"></rect>
        <rect id="path-26" x="68" y="0" width="18" height="47"></rect>
        <rect id="path-27" x="0" y="0" width="18" height="47"></rect>
        <rect id="path-28" x="17" y="0" width="18" height="47"></rect>
        <rect id="path-29" x="51" y="0" width="18" height="47"></rect>
        <rect id="path-30" x="34" y="0" width="18" height="47"></rect>
        <rect id="path-31" x="68" y="0" width="18" height="47"></rect>
        <rect id="path-32" x="0" y="0" width="18" height="47"></rect>
        <rect id="path-33" x="34" y="0" width="18" height="47"></rect>
        <rect id="path-34" x="17" y="0" width="18" height="47"></rect>
        <rect id="path-35" x="0" y="0" width="18" height="47"></rect>
        <rect id="path-36" x="17" y="0" width="18" height="47"></rect>
        <rect id="path-37" x="51" y="0" width="18" height="47"></rect>
        <rect id="path-38" x="34" y="0" width="18" height="47"></rect>
        <rect id="path-39" x="68" y="0" width="18" height="47"></rect>
        <rect id="path-40" x="0" y="0" width="18" height="47"></rect>
        <rect id="path-41" x="17" y="0" width="18" height="47"></rect>
        <rect id="path-42" x="51" y="0" width="18" height="47"></rect>
        <rect id="path-43" x="34" y="0" width="18" height="47"></rect>
        <rect id="path-44" x="68" y="0" width="18" height="47"></rect>
        <rect id="path-45" x="0" y="0" width="18" height="47"></rect>
        <rect id="path-46" x="34" y="0" width="18" height="47"></rect>
        <rect id="path-47" x="17" y="0" width="18" height="47"></rect>
        <rect id="path-48" x="0" y="0" width="18" height="47"></rect>
        <rect id="path-49" x="17" y="0" width="18" height="47"></rect>
        <rect id="path-50" x="51" y="0" width="18" height="47"></rect>
        <rect id="path-51" x="34" y="0" width="18" height="47"></rect>
        <rect id="path-52" x="68" y="0" width="18" height="47"></rect>
        <rect id="path-53" x="0" y="0" width="18" height="47"></rect>
        <rect id="path-54" x="17" y="0" width="18" height="47"></rect>
        <rect id="path-55" x="51" y="0" width="18" height="47"></rect>
        <rect id="path-56" x="34" y="0" width="18" height="47"></rect>
        <rect id="path-57" x="68" y="0" width="18" height="47"></rect>
        <rect id="path-58" x="0" y="0" width="18" height="47"></rect>
        <rect id="path-59" x="34" y="0" width="18" height="47"></rect>
        <rect id="path-60" x="17" y="0" width="18" height="47"></rect>
        <rect id="path-61" x="0" y="0" width="18" height="47"></rect>
        <rect id="path-62" x="17" y="0" width="18" height="47"></rect>
        <rect id="path-63" x="51" y="0" width="18" height="47"></rect>
        <rect id="path-64" x="34" y="0" width="18" height="47"></rect>
        <rect id="path-65" x="68" y="0" width="18" height="47"></rect>
        <rect id="path-66" x="0" y="0" width="18" height="47"></rect>
        <rect id="path-67" x="17" y="0" width="18" height="47"></rect>
        <rect id="path-68" x="51" y="0" width="18" height="47"></rect>
        <rect id="path-69" x="34" y="0" width="18" height="47"></rect>
        <rect id="path-70" x="68" y="0" width="18" height="47"></rect>
        <rect id="path-71" x="0" y="0" width="18" height="47"></rect>
        <rect id="path-72" x="34" y="0" width="18" height="47"></rect>
        <rect id="path-73" x="17" y="0" width="18" height="47"></rect>
        <rect id="path-74" x="0" y="0" width="18" height="47"></rect>
        <rect id="path-75" x="17" y="0" width="18" height="47"></rect>
        <rect id="path-76" x="51" y="0" width="18" height="47"></rect>
        <rect id="path-77" x="34" y="0" width="18" height="47"></rect>
        <rect id="path-78" x="68" y="0" width="18" height="47"></rect>
        <rect id="path-79" x="0" y="0" width="18" height="47"></rect>
        <rect id="path-80" x="17" y="0" width="18" height="47"></rect>
        <rect id="path-81" x="51" y="0" width="18" height="47"></rect>
        <rect id="path-82" x="34" y="0" width="18" height="47"></rect>
        <rect id="path-83" x="68" y="0" width="18" height="47"></rect>
        <rect id="path-84" x="0" y="0" width="18" height="47"></rect>
        <rect id="path-85" x="34" y="0" width="18" height="47"></rect>
        <rect id="path-86" x="17" y="0" width="18" height="47"></rect>
        <rect id="path-87" x="0" y="0" width="18" height="47"></rect>
        <rect id="path-88" x="17" y="0" width="18" height="47"></rect>
        <rect id="path-89" x="51" y="0" width="18" height="47"></rect>
        <rect id="path-90" x="34" y="0" width="18" height="47"></rect>
        <rect id="path-91" x="68" y="0" width="18" height="47"></rect>
        <rect id="path-92" x="0" y="0" width="18" height="47"></rect>
        <rect id="path-93" x="17" y="0" width="18" height="47"></rect>
        <rect id="path-94" x="51" y="0" width="18" height="47"></rect>
        <rect id="path-95" x="34" y="0" width="18" height="47"></rect>
        <rect id="path-96" x="68" y="0" width="18" height="47"></rect>
        <rect id="path-97" x="0" y="0" width="18" height="47"></rect>
        <rect id="path-98" x="34" y="0" width="18" height="47"></rect>
        <rect id="path-99" x="17" y="0" width="18" height="47"></rect>
        <rect id="path-100" x="0" y="0" width="18" height="47"></rect>
        <rect id="path-101" x="17" y="0" width="18" height="47"></rect>
        <rect id="path-102" x="51" y="0" width="18" height="47"></rect>
        <rect id="path-103" x="34" y="0" width="18" height="47"></rect>
        <rect id="path-104" x="68" y="0" width="18" height="47"></rect>
    </defs>
    <g id="台南新天地" stroke="none" stroke-width="1" fill="none" fill-rule="evenodd">
        <g id="all" transform="translate(-591.000000, -86.000000)"></g>
        <g id="two" transform="translate(0.000000, -86.000000)">
            <rect id="Bg" fill="#DBB492" x="5" y="559" width="366" height="5"></rect>
            <rect id="Bg" fill="#EED4BD" x="5" y="559" width="366" height="1"></rect>
            <g id="1F-Copy" transform="translate(8.000000, 503.000000)">
                <rect id="Bg" fill="#AF9584" x="0" y="0" width="359" height="56"></rect>
                <g id="lines" fill-rule="nonzero" fill="#A18877">
                    <polygon id="Line" points="351 0 351 56 352 56 352 0"></polygon>
                    <polygon id="Line-Copy-2" points="338 0 338 56 339 56 339 0"></polygon>
                    <polygon id="Line-Copy-3" points="325 0 325 56 326 56 326 0"></polygon>
                    <polygon id="Line-Copy-4" points="311 0 311 56 312 56 312 0"></polygon>
                    <polygon id="Line-Copy-5" points="298 0 298 56 299 56 299 0"></polygon>
                    <polygon id="Line-Copy-6" points="285 0 285 56 286 56 286 0"></polygon>
                    <polygon id="Line-Copy-7" points="272 0 272 56 273 56 273 0"></polygon>
                    <polygon id="Line-Copy-8" points="259 0 259 56 260 56 260 0"></polygon>
                    <polygon id="Line-Copy-9" points="245 0 245 56 246 56 246 0"></polygon>
                    <polygon id="Line-Copy-10" points="232 0 232 56 233 56 233 0"></polygon>
                    <polygon id="Line-Copy-11" points="219 0 219 56 220 56 220 0"></polygon>
                    <polygon id="Line-Copy-12" points="206 0 206 56 207 56 207 0"></polygon>
                    <polygon id="Line-Copy-13" points="193 0 193 56 194 56 194 0"></polygon>
                    <polygon id="Line-Copy-14" points="180 0 180 56 181 56 181 0"></polygon>
                    <polygon id="Line-Copy-15" points="166 0 166 56 167 56 167 0"></polygon>
                    <polygon id="Line-Copy-16" points="153 0 153 56 154 56 154 0"></polygon>
                    <polygon id="Line-Copy-17" points="140 0 140 56 141 56 141 0"></polygon>
                    <polygon id="Line-Copy-18" points="127 0 127 56 128 56 128 0"></polygon>
                    <polygon id="Line-Copy-19" points="114 0 114 56 115 56 115 0"></polygon>
                    <polygon id="Line-Copy-20" points="100 0 100 56 101 56 101 0"></polygon>
                    <polygon id="Line-Copy-21" points="87 0 87 56 88 56 88 0"></polygon>
                    <polygon id="Line-Copy-22" points="74 0 74 56 75 56 75 0"></polygon>
                    <polygon id="Line-Copy-23" points="61 0 61 56 62 56 62 0"></polygon>
                    <polygon id="Line-Copy-24" points="48 0 48 56 49 56 49 0"></polygon>
                    <polygon id="Line-Copy-25" points="34 0 34 56 35 56 35 0"></polygon>
                    <polygon id="Line-Copy" points="9 0 9 56 8 56 8 0"></polygon>
                    <polygon id="Line-Copy" points="22 0 22 56 21 56 21 0"></polygon>
                    <polygon id="Line-2" points="359 12 -2.84217094e-14 12 -2.84217094e-14 11 359 11"></polygon>
                    <polygon id="Line-2-Copy" points="359 23 -2.84217094e-14 23 -2.84217094e-14 22 359 22"></polygon>
                    <polygon id="Line-2-Copy-2" points="359 34 -2.84217094e-14 34 -2.84217094e-14 33 359 33"></polygon>
                    <polygon id="Line-2-Copy-3" points="359 45 -2.84217094e-14 45 -2.84217094e-14 44 359 44"></polygon>
                </g>
            </g>
            <g id="Group-6" transform="translate(347.000000, 523.000000)">
                <g id="Group-5" fill="#E1F2FB">
                    <rect id="Rectangle-4" x="0" y="0" width="14" height="14"></rect>
                </g>
                <rect id="Rectangle-4" fill="#D1E3ED" x="0" y="0" width="14" height="2"></rect>
                <rect id="Rectangle-4-Copy" fill-opacity="0.1" fill="#000000" x="0" y="14" width="14" height="2"></rect>
            </g>
            <g id="Group-6-Copy" transform="translate(292.000000, 523.000000)">
                <g id="Group-5" fill="#E1F2FB">
                    <rect id="Rectangle-4" x="0" y="0" width="14" height="14"></rect>
                </g>
                <rect id="Rectangle-4" fill="#D1E3ED" x="0" y="0" width="14" height="2"></rect>
                <rect id="Rectangle-4-Copy" fill-opacity="0.1" fill="#000000" x="0" y="14" width="14" height="2"></rect>
            </g>
            <g id="Group-6-Copy-2" transform="translate(236.000000, 523.000000)">
                <g id="Group-5" fill="#E1F2FB">
                    <rect id="Rectangle-4" x="0" y="0" width="14" height="14"></rect>
                </g>
                <rect id="Rectangle-4" fill="#D1E3ED" x="0" y="0" width="14" height="2"></rect>
                <rect id="Rectangle-4-Copy" fill-opacity="0.1" fill="#000000" x="0" y="14" width="14" height="2"></rect>
            </g>
            <g id="Group-6-Copy-3" transform="translate(181.000000, 523.000000)">
                <g id="Group-5" fill="#E1F2FB">
                    <rect id="Rectangle-4" x="0" y="0" width="14" height="14"></rect>
                </g>
                <rect id="Rectangle-4" fill="#D1E3ED" x="0" y="0" width="14" height="2"></rect>
                <rect id="Rectangle-4-Copy" fill-opacity="0.1" fill="#000000" x="0" y="14" width="14" height="2"></rect>
            </g>
            <g id="Group-6-Copy-4" transform="translate(125.000000, 523.000000)">
                <g id="Group-5" fill="#E1F2FB">
                    <rect id="Rectangle-4" x="0" y="0" width="14" height="14"></rect>
                </g>
                <rect id="Rectangle-4" fill="#D1E3ED" x="0" y="0" width="14" height="2"></rect>
                <rect id="Rectangle-4-Copy" fill-opacity="0.1" fill="#000000" x="0" y="14" width="14" height="2"></rect>
            </g>
            <g id="Group-6-Copy-5" transform="translate(70.000000, 523.000000)">
                <g id="Group-5" fill="#E1F2FB">
                    <rect id="Rectangle-4" x="0" y="0" width="14" height="14"></rect>
                </g>
                <rect id="Rectangle-4" fill="#D1E3ED" x="0" y="0" width="14" height="2"></rect>
                <rect id="Rectangle-4-Copy" fill-opacity="0.1" fill="#000000" x="0" y="14" width="14" height="2"></rect>
            </g>
            <g id="Group-6-Copy-6" transform="translate(14.000000, 523.000000)">
                <g id="Group-5" fill="#E1F2FB">
                    <rect id="Rectangle-4" x="0" y="0" width="14" height="14"></rect>
                </g>
                <rect id="Rectangle-4" fill="#D1E3ED" x="0" y="0" width="14" height="2"></rect>
                <rect id="Rectangle-4-Copy" fill-opacity="0.1" fill="#000000" x="0" y="14" width="14" height="2"></rect>
            </g>
            <g id="3F-4F" transform="translate(8.000000, 442.000000)">
                <g id="Group" stroke-width="1" transform="translate(3.000000, 0.000000)">
                    <rect id="Bg" fill="#E5E1E5" x="0" y="0" width="354" height="61"></rect>
                    <rect id="Bg" fill="#FCFBF3" x="0" y="52" width="354" height="9"></rect>
                    <g id="Group-2" transform="translate(5.000000, 52.000000)" fill-rule="nonzero" fill="#E1DFD2">
                        <polygon id="Line" points="343 0 343 9 344 9 344 0"></polygon>
                        <polygon id="Line-Copy" points="324 0 324 9 325 9 325 0"></polygon>
                        <polygon id="Line-Copy-2" points="305 0 305 9 306 9 306 0"></polygon>
                        <polygon id="Line-Copy-4" points="286 0 286 9 287 9 287 0"></polygon>
                        <polygon id="Line-Copy-6" points="267 0 267 9 268 9 268 0"></polygon>
                        <polygon id="Line-Copy-8" points="248 0 248 9 249 9 249 0"></polygon>
                        <polygon id="Line-Copy-10" points="229 0 229 9 230 9 230 0"></polygon>
                        <polygon id="Line-Copy-12" points="210 0 210 9 211 9 211 0"></polygon>
                        <polygon id="Line-Copy-14" points="191 0 191 9 192 9 192 0"></polygon>
                        <polygon id="Line-Copy-16" points="172 0 172 9 173 9 173 0"></polygon>
                        <polygon id="Line-Copy-18" points="153 0 153 9 154 9 154 0"></polygon>
                        <polygon id="Line-Copy-20" points="134 0 134 9 135 9 135 0"></polygon>
                        <polygon id="Line-Copy-22" points="115 0 115 9 116 9 116 0"></polygon>
                        <polygon id="Line-Copy-24" points="96 0 96 9 97 9 97 0"></polygon>
                        <polygon id="Line-Copy-26" points="77 0 77 9 78 9 78 0"></polygon>
                        <polygon id="Line-Copy-28" points="58 0 58 9 59 9 59 0"></polygon>
                        <polygon id="Line-Copy-30" points="39 0 39 9 40 9 40 0"></polygon>
                        <polygon id="Line-Copy" points="1 0 1 9 0 9 0 0"></polygon>
                        <polygon id="Line-Copy" points="20 0 20 9 19 9 19 0"></polygon>
                    </g>
                    <rect id="Bg" fill-opacity="0.06" fill="#000000" x="0" y="52" width="354" height="2"></rect>
                    <polygon id="Line" fill="#CEC5CE" fill-rule="nonzero" points="348 0 348 47 349 47 349 0"></polygon>
                    <polygon id="Line-Copy" fill="#CEC5CE" fill-rule="nonzero" points="329 0 329 47 330 47 330 0"></polygon>
                    <polygon id="Line-Copy-3" fill="#CEC5CE" fill-rule="nonzero" points="310 0 310 47 311 47 311 0"></polygon>
                    <polygon id="Line-Copy-5" fill="#CEC5CE" fill-rule="nonzero" points="291 0 291 47 292 47 292 0"></polygon>
                    <polygon id="Line-Copy-7" fill="#CEC5CE" fill-rule="nonzero" points="272 0 272 47 273 47 273 0"></polygon>
                    <polygon id="Line-Copy-9" fill="#CEC5CE" fill-rule="nonzero" points="253 0 253 47 254 47 254 0"></polygon>
                    <polygon id="Line-Copy-11" fill="#CEC5CE" fill-rule="nonzero" points="234 0 234 47 235 47 235 0"></polygon>
                    <polygon id="Line-Copy-13" fill="#CEC5CE" fill-rule="nonzero" points="215 0 215 47 216 47 216 0"></polygon>
                    <polygon id="Line-Copy-15" fill="#CEC5CE" fill-rule="nonzero" points="196 0 196 47 197 47 197 0"></polygon>
                    <polygon id="Line-Copy-17" fill="#CEC5CE" fill-rule="nonzero" points="177 0 177 47 178 47 178 0"></polygon>
                    <polygon id="Line-Copy-19" fill="#CEC5CE" fill-rule="nonzero" points="158 0 158 47 159 47 159 0"></polygon>
                    <polygon id="Line-Copy-21" fill="#CEC5CE" fill-rule="nonzero" points="139 0 139 47 140 47 140 0"></polygon>
                    <polygon id="Line-Copy-23" fill="#CEC5CE" fill-rule="nonzero" points="120 0 120 47 121 47 121 0"></polygon>
                    <polygon id="Line-Copy-25" fill="#CEC5CE" fill-rule="nonzero" points="101 0 101 47 102 47 102 0"></polygon>
                    <polygon id="Line-Copy-27" fill="#CEC5CE" fill-rule="nonzero" points="82 0 82 47 83 47 83 0"></polygon>
                    <polygon id="Line-Copy-29" fill="#CEC5CE" fill-rule="nonzero" points="63 0 63 47 64 47 64 0"></polygon>
                    <polygon id="Line-Copy-31" fill="#CEC5CE" fill-rule="nonzero" points="44 0 44 47 45 47 45 0"></polygon>
                    <polygon id="Line-Copy" fill="#CEC5CE" fill-rule="nonzero" points="6 0 6 47 5 47 5 0"></polygon>
                    <polygon id="Line-Copy" fill="#CEC5CE" fill-rule="nonzero" points="25 0 25 47 24 47 24 0"></polygon>
                    <polygon id="Line-2" fill="#CEC5CE" fill-rule="nonzero" points="354 48 -2.84217094e-14 48 -2.84217094e-14 47 354 47"></polygon>
                    <polygon id="Line-2-Copy-2" fill="#CEC5CE" fill-rule="nonzero" points="354 22 -2.84217094e-14 22 -2.84217094e-14 21 354 21"></polygon>
                    <polygon id="Line-2" fill="#CEC5CE" fill-rule="nonzero" points="354 9 -2.84217094e-14 9 -2.84217094e-14 8 354 8"></polygon>
                    <polygon id="Line-2-Copy" fill="#CEC5CE" fill-rule="nonzero" points="354 35 -2.84217094e-14 35 -2.84217094e-14 34 354 34"></polygon>
                </g>
                <g id="Group-3" stroke-width="1" transform="translate(26.000000, 0.000000)">
                    <g id="Rectangle-4">
                        <use fill="#E1F2FB" fill-rule="evenodd" xlink:href="#path-1"></use>
                        <rect stroke="#CAD1DD" stroke-width="1" x="0.5" y="0.5" width="17" height="46"></rect>
                    </g>
                    <g id="Rectangle-4">
                        <use fill="#E1F2FB" fill-rule="evenodd" xlink:href="#path-2"></use>
                        <rect stroke="#CAD1DD" stroke-width="1" x="17.5" y="0.5" width="17" height="46"></rect>
                    </g>
                    <g id="Rectangle-4">
                        <use fill="#E1F2FB" fill-rule="evenodd" xlink:href="#path-3"></use>
                        <rect stroke="#CAD1DD" stroke-width="1" x="51.5" y="0.5" width="17" height="46"></rect>
                    </g>
                    <g id="Rectangle-4">
                        <use fill="#E1F2FB" fill-rule="evenodd" xlink:href="#path-4"></use>
                        <rect stroke="#CAD1DD" stroke-width="1" x="34.5" y="0.5" width="17" height="46"></rect>
                    </g>
                    <g id="Rectangle-4">
                        <use fill="#E1F2FB" fill-rule="evenodd" xlink:href="#path-5"></use>
                        <rect stroke="#CAD1DD" stroke-width="1" x="68.5" y="0.5" width="17" height="46"></rect>
                    </g>
                </g>
                <g id="Group-3-Copy-2" stroke-width="1" transform="translate(154.000000, 0.000000)">
                    <g id="Rectangle-4">
                        <use fill="#E1F2FB" fill-rule="evenodd" xlink:href="#path-6"></use>
                        <rect stroke="#CAD1DD" stroke-width="1" x="0.5" y="0.5" width="17" height="46"></rect>
                    </g>
                    <g id="Rectangle-4">
                        <use fill="#E1F2FB" fill-rule="evenodd" xlink:href="#path-7"></use>
                        <rect stroke="#CAD1DD" stroke-width="1" x="34.5" y="0.5" width="17" height="46"></rect>
                    </g>
                    <g id="Rectangle-4">
                        <use fill="#E1F2FB" fill-rule="evenodd" xlink:href="#path-8"></use>
                        <rect stroke="#CAD1DD" stroke-width="1" x="17.5" y="0.5" width="17" height="46"></rect>
                    </g>
                </g>
                <g id="Group-3-Copy" stroke-width="1" transform="translate(248.000000, 0.000000)">
                    <g id="Rectangle-4">
                        <use fill="#E1F2FB" fill-rule="evenodd" xlink:href="#path-9"></use>
                        <rect stroke="#CAD1DD" stroke-width="1" x="0.5" y="0.5" width="17" height="46"></rect>
                    </g>
                    <g id="Rectangle-4">
                        <use fill="#E1F2FB" fill-rule="evenodd" xlink:href="#path-10"></use>
                        <rect stroke="#CAD1DD" stroke-width="1" x="17.5" y="0.5" width="17" height="46"></rect>
                    </g>
                    <g id="Rectangle-4">
                        <use fill="#E1F2FB" fill-rule="evenodd" xlink:href="#path-11"></use>
                        <rect stroke="#CAD1DD" stroke-width="1" x="51.5" y="0.5" width="17" height="46"></rect>
                    </g>
                    <g id="Rectangle-4">
                        <use fill="#E1F2FB" fill-rule="evenodd" xlink:href="#path-12"></use>
                        <rect stroke="#CAD1DD" stroke-width="1" x="34.5" y="0.5" width="17" height="46"></rect>
                    </g>
                    <g id="Rectangle-4">
                        <use fill="#E1F2FB" fill-rule="evenodd" xlink:href="#path-13"></use>
                        <rect stroke="#CAD1DD" stroke-width="1" x="68.5" y="0.5" width="17" height="46"></rect>
                    </g>
                </g>
                <g id="Group-4" stroke-width="1" transform="translate(2.000000, 47.000000)">
                    <polygon id="Line-2-Copy-3" fill="#F0F2F7" fill-rule="nonzero" points="356 1 0 1 0 0 356 0"></polygon>
                    <polygon id="Line-2-Copy-4" fill="#CAD1DD" fill-rule="nonzero" points="355 2 1 2 1 1 355 1"></polygon>
                    <polygon id="Line-2-Copy-5" fill="#F0F2F7" fill-rule="nonzero" points="356 3 0 3 0 2 356 2"></polygon>
                    <polygon id="Line-2-Copy-7" fill="#F0F2F7" fill-rule="nonzero" points="356 5 0 5 0 4 356 4"></polygon>
                    <polygon id="Line-2-Copy-6" fill="#CAD1DD" fill-rule="nonzero" points="355 4 1 4 1 3 355 3"></polygon>
                </g>
                <rect id="Rectangle-13" fill-opacity="0.06" fill="#000000" x="3" y="0" width="354" height="5"></rect>
            </g>
            <g id="3F-4F" transform="translate(8.000000, 381.000000)">
                <g id="Group" stroke-width="1" transform="translate(3.000000, 0.000000)">
                    <rect id="Bg" fill="#E5E1E5" x="0" y="0" width="354" height="61"></rect>
                    <rect id="Bg" fill="#FCFBF3" x="0" y="52" width="354" height="9"></rect>
                    <g id="Group-2" transform="translate(5.000000, 52.000000)" fill-rule="nonzero" fill="#E1DFD2">
                        <polygon id="Line" points="343 0 343 9 344 9 344 0"></polygon>
                        <polygon id="Line-Copy" points="324 0 324 9 325 9 325 0"></polygon>
                        <polygon id="Line-Copy-2" points="305 0 305 9 306 9 306 0"></polygon>
                        <polygon id="Line-Copy-4" points="286 0 286 9 287 9 287 0"></polygon>
                        <polygon id="Line-Copy-6" points="267 0 267 9 268 9 268 0"></polygon>
                        <polygon id="Line-Copy-8" points="248 0 248 9 249 9 249 0"></polygon>
                        <polygon id="Line-Copy-10" points="229 0 229 9 230 9 230 0"></polygon>
                        <polygon id="Line-Copy-12" points="210 0 210 9 211 9 211 0"></polygon>
                        <polygon id="Line-Copy-14" points="191 0 191 9 192 9 192 0"></polygon>
                        <polygon id="Line-Copy-16" points="172 0 172 9 173 9 173 0"></polygon>
                        <polygon id="Line-Copy-18" points="153 0 153 9 154 9 154 0"></polygon>
                        <polygon id="Line-Copy-20" points="134 0 134 9 135 9 135 0"></polygon>
                        <polygon id="Line-Copy-22" points="115 0 115 9 116 9 116 0"></polygon>
                        <polygon id="Line-Copy-24" points="96 0 96 9 97 9 97 0"></polygon>
                        <polygon id="Line-Copy-26" points="77 0 77 9 78 9 78 0"></polygon>
                        <polygon id="Line-Copy-28" points="58 0 58 9 59 9 59 0"></polygon>
                        <polygon id="Line-Copy-30" points="39 0 39 9 40 9 40 0"></polygon>
                        <polygon id="Line-Copy" points="1 0 1 9 0 9 0 0"></polygon>
                        <polygon id="Line-Copy" points="20 0 20 9 19 9 19 0"></polygon>
                    </g>
                    <rect id="Bg" fill-opacity="0.06" fill="#000000" x="0" y="52" width="354" height="2"></rect>
                    <polygon id="Line" fill="#CEC5CE" fill-rule="nonzero" points="348 0 348 47 349 47 349 0"></polygon>
                    <polygon id="Line-Copy" fill="#CEC5CE" fill-rule="nonzero" points="329 0 329 47 330 47 330 0"></polygon>
                    <polygon id="Line-Copy-3" fill="#CEC5CE" fill-rule="nonzero" points="310 0 310 47 311 47 311 0"></polygon>
                    <polygon id="Line-Copy-5" fill="#CEC5CE" fill-rule="nonzero" points="291 0 291 47 292 47 292 0"></polygon>
                    <polygon id="Line-Copy-7" fill="#CEC5CE" fill-rule="nonzero" points="272 0 272 47 273 47 273 0"></polygon>
                    <polygon id="Line-Copy-9" fill="#CEC5CE" fill-rule="nonzero" points="253 0 253 47 254 47 254 0"></polygon>
                    <polygon id="Line-Copy-11" fill="#CEC5CE" fill-rule="nonzero" points="234 0 234 47 235 47 235 0"></polygon>
                    <polygon id="Line-Copy-13" fill="#CEC5CE" fill-rule="nonzero" points="215 0 215 47 216 47 216 0"></polygon>
                    <polygon id="Line-Copy-15" fill="#CEC5CE" fill-rule="nonzero" points="196 0 196 47 197 47 197 0"></polygon>
                    <polygon id="Line-Copy-17" fill="#CEC5CE" fill-rule="nonzero" points="177 0 177 47 178 47 178 0"></polygon>
                    <polygon id="Line-Copy-19" fill="#CEC5CE" fill-rule="nonzero" points="158 0 158 47 159 47 159 0"></polygon>
                    <polygon id="Line-Copy-21" fill="#CEC5CE" fill-rule="nonzero" points="139 0 139 47 140 47 140 0"></polygon>
                    <polygon id="Line-Copy-23" fill="#CEC5CE" fill-rule="nonzero" points="120 0 120 47 121 47 121 0"></polygon>
                    <polygon id="Line-Copy-25" fill="#CEC5CE" fill-rule="nonzero" points="101 0 101 47 102 47 102 0"></polygon>
                    <polygon id="Line-Copy-27" fill="#CEC5CE" fill-rule="nonzero" points="82 0 82 47 83 47 83 0"></polygon>
                    <polygon id="Line-Copy-29" fill="#CEC5CE" fill-rule="nonzero" points="63 0 63 47 64 47 64 0"></polygon>
                    <polygon id="Line-Copy-31" fill="#CEC5CE" fill-rule="nonzero" points="44 0 44 47 45 47 45 0"></polygon>
                    <polygon id="Line-Copy" fill="#CEC5CE" fill-rule="nonzero" points="6 0 6 47 5 47 5 0"></polygon>
                    <polygon id="Line-Copy" fill="#CEC5CE" fill-rule="nonzero" points="25 0 25 47 24 47 24 0"></polygon>
                    <polygon id="Line-2" fill="#CEC5CE" fill-rule="nonzero" points="354 48 -2.84217094e-14 48 -2.84217094e-14 47 354 47"></polygon>
                    <polygon id="Line-2-Copy-2" fill="#CEC5CE" fill-rule="nonzero" points="354 22 -2.84217094e-14 22 -2.84217094e-14 21 354 21"></polygon>
                    <polygon id="Line-2" fill="#CEC5CE" fill-rule="nonzero" points="354 9 -2.84217094e-14 9 -2.84217094e-14 8 354 8"></polygon>
                    <polygon id="Line-2-Copy" fill="#CEC5CE" fill-rule="nonzero" points="354 35 -2.84217094e-14 35 -2.84217094e-14 34 354 34"></polygon>
                </g>
                <g id="Group-3" stroke-width="1" transform="translate(26.000000, 0.000000)">
                    <g id="Rectangle-4">
                        <use fill="#E1F2FB" fill-rule="evenodd" xlink:href="#path-14"></use>
                        <rect stroke="#CAD1DD" stroke-width="1" x="0.5" y="0.5" width="17" height="46"></rect>
                    </g>
                    <g id="Rectangle-4">
                        <use fill="#E1F2FB" fill-rule="evenodd" xlink:href="#path-15"></use>
                        <rect stroke="#CAD1DD" stroke-width="1" x="17.5" y="0.5" width="17" height="46"></rect>
                    </g>
                    <g id="Rectangle-4">
                        <use fill="#E1F2FB" fill-rule="evenodd" xlink:href="#path-16"></use>
                        <rect stroke="#CAD1DD" stroke-width="1" x="51.5" y="0.5" width="17" height="46"></rect>
                    </g>
                    <g id="Rectangle-4">
                        <use fill="#E1F2FB" fill-rule="evenodd" xlink:href="#path-17"></use>
                        <rect stroke="#CAD1DD" stroke-width="1" x="34.5" y="0.5" width="17" height="46"></rect>
                    </g>
                    <g id="Rectangle-4">
                        <use fill="#E1F2FB" fill-rule="evenodd" xlink:href="#path-18"></use>
                        <rect stroke="#CAD1DD" stroke-width="1" x="68.5" y="0.5" width="17" height="46"></rect>
                    </g>
                </g>
                <g id="Group-3-Copy-2" stroke-width="1" transform="translate(154.000000, 0.000000)">
                    <g id="Rectangle-4">
                        <use fill="#E1F2FB" fill-rule="evenodd" xlink:href="#path-19"></use>
                        <rect stroke="#CAD1DD" stroke-width="1" x="0.5" y="0.5" width="17" height="46"></rect>
                    </g>
                    <g id="Rectangle-4">
                        <use fill="#E1F2FB" fill-rule="evenodd" xlink:href="#path-20"></use>
                        <rect stroke="#CAD1DD" stroke-width="1" x="34.5" y="0.5" width="17" height="46"></rect>
                    </g>
                    <g id="Rectangle-4">
                        <use fill="#E1F2FB" fill-rule="evenodd" xlink:href="#path-21"></use>
                        <rect stroke="#CAD1DD" stroke-width="1" x="17.5" y="0.5" width="17" height="46"></rect>
                    </g>
                </g>
                <g id="Group-3-Copy" stroke-width="1" transform="translate(248.000000, 0.000000)">
                    <g id="Rectangle-4">
                        <use fill="#E1F2FB" fill-rule="evenodd" xlink:href="#path-22"></use>
                        <rect stroke="#CAD1DD" stroke-width="1" x="0.5" y="0.5" width="17" height="46"></rect>
                    </g>
                    <g id="Rectangle-4">
                        <use fill="#E1F2FB" fill-rule="evenodd" xlink:href="#path-23"></use>
                        <rect stroke="#CAD1DD" stroke-width="1" x="17.5" y="0.5" width="17" height="46"></rect>
                    </g>
                    <g id="Rectangle-4">
                        <use fill="#E1F2FB" fill-rule="evenodd" xlink:href="#path-24"></use>
                        <rect stroke="#CAD1DD" stroke-width="1" x="51.5" y="0.5" width="17" height="46"></rect>
                    </g>
                    <g id="Rectangle-4">
                        <use fill="#E1F2FB" fill-rule="evenodd" xlink:href="#path-25"></use>
                        <rect stroke="#CAD1DD" stroke-width="1" x="34.5" y="0.5" width="17" height="46"></rect>
                    </g>
                    <g id="Rectangle-4">
                        <use fill="#E1F2FB" fill-rule="evenodd" xlink:href="#path-26"></use>
                        <rect stroke="#CAD1DD" stroke-width="1" x="68.5" y="0.5" width="17" height="46"></rect>
                    </g>
                </g>
                <g id="Group-4" stroke-width="1" transform="translate(2.000000, 47.000000)">
                    <polygon id="Line-2-Copy-3" fill="#F0F2F7" fill-rule="nonzero" points="356 1 0 1 0 0 356 0"></polygon>
                    <polygon id="Line-2-Copy-4" fill="#CAD1DD" fill-rule="nonzero" points="355 2 1 2 1 1 355 1"></polygon>
                    <polygon id="Line-2-Copy-5" fill="#F0F2F7" fill-rule="nonzero" points="356 3 0 3 0 2 356 2"></polygon>
                    <polygon id="Line-2-Copy-7" fill="#F0F2F7" fill-rule="nonzero" points="356 5 0 5 0 4 356 4"></polygon>
                    <polygon id="Line-2-Copy-6" fill="#CAD1DD" fill-rule="nonzero" points="355 4 1 4 1 3 355 3"></polygon>
                </g>
                <rect id="Rectangle-13" fill-opacity="0.06" fill="#000000" x="3" y="0" width="354" height="5"></rect>
            </g>
            <g id="3F-4F" transform="translate(8.000000, 442.000000)">
                <g id="Group" stroke-width="1" transform="translate(3.000000, 0.000000)">
                    <rect id="Bg" fill="#E5E1E5" x="0" y="0" width="354" height="61"></rect>
                    <rect id="Bg" fill="#FCFBF3" x="0" y="52" width="354" height="9"></rect>
                    <g id="Group-2" transform="translate(5.000000, 52.000000)" fill-rule="nonzero" fill="#E1DFD2">
                        <polygon id="Line" points="343 0 343 9 344 9 344 0"></polygon>
                        <polygon id="Line-Copy" points="324 0 324 9 325 9 325 0"></polygon>
                        <polygon id="Line-Copy-2" points="305 0 305 9 306 9 306 0"></polygon>
                        <polygon id="Line-Copy-4" points="286 0 286 9 287 9 287 0"></polygon>
                        <polygon id="Line-Copy-6" points="267 0 267 9 268 9 268 0"></polygon>
                        <polygon id="Line-Copy-8" points="248 0 248 9 249 9 249 0"></polygon>
                        <polygon id="Line-Copy-10" points="229 0 229 9 230 9 230 0"></polygon>
                        <polygon id="Line-Copy-12" points="210 0 210 9 211 9 211 0"></polygon>
                        <polygon id="Line-Copy-14" points="191 0 191 9 192 9 192 0"></polygon>
                        <polygon id="Line-Copy-16" points="172 0 172 9 173 9 173 0"></polygon>
                        <polygon id="Line-Copy-18" points="153 0 153 9 154 9 154 0"></polygon>
                        <polygon id="Line-Copy-20" points="134 0 134 9 135 9 135 0"></polygon>
                        <polygon id="Line-Copy-22" points="115 0 115 9 116 9 116 0"></polygon>
                        <polygon id="Line-Copy-24" points="96 0 96 9 97 9 97 0"></polygon>
                        <polygon id="Line-Copy-26" points="77 0 77 9 78 9 78 0"></polygon>
                        <polygon id="Line-Copy-28" points="58 0 58 9 59 9 59 0"></polygon>
                        <polygon id="Line-Copy-30" points="39 0 39 9 40 9 40 0"></polygon>
                        <polygon id="Line-Copy" points="1 0 1 9 0 9 0 0"></polygon>
                        <polygon id="Line-Copy" points="20 0 20 9 19 9 19 0"></polygon>
                    </g>
                    <rect id="Bg" fill-opacity="0.06" fill="#000000" x="0" y="52" width="354" height="2"></rect>
                    <polygon id="Line" fill="#CEC5CE" fill-rule="nonzero" points="348 0 348 47 349 47 349 0"></polygon>
                    <polygon id="Line-Copy" fill="#CEC5CE" fill-rule="nonzero" points="329 0 329 47 330 47 330 0"></polygon>
                    <polygon id="Line-Copy-3" fill="#CEC5CE" fill-rule="nonzero" points="310 0 310 47 311 47 311 0"></polygon>
                    <polygon id="Line-Copy-5" fill="#CEC5CE" fill-rule="nonzero" points="291 0 291 47 292 47 292 0"></polygon>
                    <polygon id="Line-Copy-7" fill="#CEC5CE" fill-rule="nonzero" points="272 0 272 47 273 47 273 0"></polygon>
                    <polygon id="Line-Copy-9" fill="#CEC5CE" fill-rule="nonzero" points="253 0 253 47 254 47 254 0"></polygon>
                    <polygon id="Line-Copy-11" fill="#CEC5CE" fill-rule="nonzero" points="234 0 234 47 235 47 235 0"></polygon>
                    <polygon id="Line-Copy-13" fill="#CEC5CE" fill-rule="nonzero" points="215 0 215 47 216 47 216 0"></polygon>
                    <polygon id="Line-Copy-15" fill="#CEC5CE" fill-rule="nonzero" points="196 0 196 47 197 47 197 0"></polygon>
                    <polygon id="Line-Copy-17" fill="#CEC5CE" fill-rule="nonzero" points="177 0 177 47 178 47 178 0"></polygon>
                    <polygon id="Line-Copy-19" fill="#CEC5CE" fill-rule="nonzero" points="158 0 158 47 159 47 159 0"></polygon>
                    <polygon id="Line-Copy-21" fill="#CEC5CE" fill-rule="nonzero" points="139 0 139 47 140 47 140 0"></polygon>
                    <polygon id="Line-Copy-23" fill="#CEC5CE" fill-rule="nonzero" points="120 0 120 47 121 47 121 0"></polygon>
                    <polygon id="Line-Copy-25" fill="#CEC5CE" fill-rule="nonzero" points="101 0 101 47 102 47 102 0"></polygon>
                    <polygon id="Line-Copy-27" fill="#CEC5CE" fill-rule="nonzero" points="82 0 82 47 83 47 83 0"></polygon>
                    <polygon id="Line-Copy-29" fill="#CEC5CE" fill-rule="nonzero" points="63 0 63 47 64 47 64 0"></polygon>
                    <polygon id="Line-Copy-31" fill="#CEC5CE" fill-rule="nonzero" points="44 0 44 47 45 47 45 0"></polygon>
                    <polygon id="Line-Copy" fill="#CEC5CE" fill-rule="nonzero" points="6 0 6 47 5 47 5 0"></polygon>
                    <polygon id="Line-Copy" fill="#CEC5CE" fill-rule="nonzero" points="25 0 25 47 24 47 24 0"></polygon>
                    <polygon id="Line-2" fill="#CEC5CE" fill-rule="nonzero" points="354 48 -2.84217094e-14 48 -2.84217094e-14 47 354 47"></polygon>
                    <polygon id="Line-2-Copy-2" fill="#CEC5CE" fill-rule="nonzero" points="354 22 -2.84217094e-14 22 -2.84217094e-14 21 354 21"></polygon>
                    <polygon id="Line-2" fill="#CEC5CE" fill-rule="nonzero" points="354 9 -2.84217094e-14 9 -2.84217094e-14 8 354 8"></polygon>
                    <polygon id="Line-2-Copy" fill="#CEC5CE" fill-rule="nonzero" points="354 35 -2.84217094e-14 35 -2.84217094e-14 34 354 34"></polygon>
                </g>
                <g id="Group-3" stroke-width="1" transform="translate(26.000000, 0.000000)">
                    <g id="Rectangle-4">
                        <use fill="#E1F2FB" fill-rule="evenodd" xlink:href="#path-27"></use>
                        <rect stroke="#CAD1DD" stroke-width="1" x="0.5" y="0.5" width="17" height="46"></rect>
                    </g>
                    <g id="Rectangle-4">
                        <use fill="#E1F2FB" fill-rule="evenodd" xlink:href="#path-28"></use>
                        <rect stroke="#CAD1DD" stroke-width="1" x="17.5" y="0.5" width="17" height="46"></rect>
                    </g>
                    <g id="Rectangle-4">
                        <use fill="#E1F2FB" fill-rule="evenodd" xlink:href="#path-29"></use>
                        <rect stroke="#CAD1DD" stroke-width="1" x="51.5" y="0.5" width="17" height="46"></rect>
                    </g>
                    <g id="Rectangle-4">
                        <use fill="#E1F2FB" fill-rule="evenodd" xlink:href="#path-30"></use>
                        <rect stroke="#CAD1DD" stroke-width="1" x="34.5" y="0.5" width="17" height="46"></rect>
                    </g>
                    <g id="Rectangle-4">
                        <use fill="#E1F2FB" fill-rule="evenodd" xlink:href="#path-31"></use>
                        <rect stroke="#CAD1DD" stroke-width="1" x="68.5" y="0.5" width="17" height="46"></rect>
                    </g>
                </g>
                <g id="Group-3-Copy-2" stroke-width="1" transform="translate(154.000000, 0.000000)">
                    <g id="Rectangle-4">
                        <use fill="#E1F2FB" fill-rule="evenodd" xlink:href="#path-32"></use>
                        <rect stroke="#CAD1DD" stroke-width="1" x="0.5" y="0.5" width="17" height="46"></rect>
                    </g>
                    <g id="Rectangle-4">
                        <use fill="#E1F2FB" fill-rule="evenodd" xlink:href="#path-33"></use>
                        <rect stroke="#CAD1DD" stroke-width="1" x="34.5" y="0.5" width="17" height="46"></rect>
                    </g>
                    <g id="Rectangle-4">
                        <use fill="#E1F2FB" fill-rule="evenodd" xlink:href="#path-34"></use>
                        <rect stroke="#CAD1DD" stroke-width="1" x="17.5" y="0.5" width="17" height="46"></rect>
                    </g>
                </g>
                <g id="Group-3-Copy" stroke-width="1" transform="translate(248.000000, 0.000000)">
                    <g id="Rectangle-4">
                        <use fill="#E1F2FB" fill-rule="evenodd" xlink:href="#path-35"></use>
                        <rect stroke="#CAD1DD" stroke-width="1" x="0.5" y="0.5" width="17" height="46"></rect>
                    </g>
                    <g id="Rectangle-4">
                        <use fill="#E1F2FB" fill-rule="evenodd" xlink:href="#path-36"></use>
                        <rect stroke="#CAD1DD" stroke-width="1" x="17.5" y="0.5" width="17" height="46"></rect>
                    </g>
                    <g id="Rectangle-4">
                        <use fill="#E1F2FB" fill-rule="evenodd" xlink:href="#path-37"></use>
                        <rect stroke="#CAD1DD" stroke-width="1" x="51.5" y="0.5" width="17" height="46"></rect>
                    </g>
                    <g id="Rectangle-4">
                        <use fill="#E1F2FB" fill-rule="evenodd" xlink:href="#path-38"></use>
                        <rect stroke="#CAD1DD" stroke-width="1" x="34.5" y="0.5" width="17" height="46"></rect>
                    </g>
                    <g id="Rectangle-4">
                        <use fill="#E1F2FB" fill-rule="evenodd" xlink:href="#path-39"></use>
                        <rect stroke="#CAD1DD" stroke-width="1" x="68.5" y="0.5" width="17" height="46"></rect>
                    </g>
                </g>
                <g id="Group-4" stroke-width="1" transform="translate(2.000000, 47.000000)">
                    <polygon id="Line-2-Copy-3" fill="#F0F2F7" fill-rule="nonzero" points="356 1 0 1 0 0 356 0"></polygon>
                    <polygon id="Line-2-Copy-4" fill="#CAD1DD" fill-rule="nonzero" points="355 2 1 2 1 1 355 1"></polygon>
                    <polygon id="Line-2-Copy-5" fill="#F0F2F7" fill-rule="nonzero" points="356 3 0 3 0 2 356 2"></polygon>
                    <polygon id="Line-2-Copy-7" fill="#F0F2F7" fill-rule="nonzero" points="356 5 0 5 0 4 356 4"></polygon>
                    <polygon id="Line-2-Copy-6" fill="#CAD1DD" fill-rule="nonzero" points="355 4 1 4 1 3 355 3"></polygon>
                </g>
                <rect id="Rectangle-13" fill-opacity="0.06" fill="#000000" x="3" y="0" width="354" height="5"></rect>
            </g>
            <g id="3F-4F" transform="translate(8.000000, 381.000000)">
                <g id="Group" stroke-width="1" transform="translate(3.000000, 0.000000)">
                    <rect id="Bg" fill="#E5E1E5" x="0" y="0" width="354" height="61"></rect>
                    <rect id="Bg" fill="#FCFBF3" x="0" y="52" width="354" height="9"></rect>
                    <g id="Group-2" transform="translate(5.000000, 52.000000)" fill-rule="nonzero" fill="#E1DFD2">
                        <polygon id="Line" points="343 0 343 9 344 9 344 0"></polygon>
                        <polygon id="Line-Copy" points="324 0 324 9 325 9 325 0"></polygon>
                        <polygon id="Line-Copy-2" points="305 0 305 9 306 9 306 0"></polygon>
                        <polygon id="Line-Copy-4" points="286 0 286 9 287 9 287 0"></polygon>
                        <polygon id="Line-Copy-6" points="267 0 267 9 268 9 268 0"></polygon>
                        <polygon id="Line-Copy-8" points="248 0 248 9 249 9 249 0"></polygon>
                        <polygon id="Line-Copy-10" points="229 0 229 9 230 9 230 0"></polygon>
                        <polygon id="Line-Copy-12" points="210 0 210 9 211 9 211 0"></polygon>
                        <polygon id="Line-Copy-14" points="191 0 191 9 192 9 192 0"></polygon>
                        <polygon id="Line-Copy-16" points="172 0 172 9 173 9 173 0"></polygon>
                        <polygon id="Line-Copy-18" points="153 0 153 9 154 9 154 0"></polygon>
                        <polygon id="Line-Copy-20" points="134 0 134 9 135 9 135 0"></polygon>
                        <polygon id="Line-Copy-22" points="115 0 115 9 116 9 116 0"></polygon>
                        <polygon id="Line-Copy-24" points="96 0 96 9 97 9 97 0"></polygon>
                        <polygon id="Line-Copy-26" points="77 0 77 9 78 9 78 0"></polygon>
                        <polygon id="Line-Copy-28" points="58 0 58 9 59 9 59 0"></polygon>
                        <polygon id="Line-Copy-30" points="39 0 39 9 40 9 40 0"></polygon>
                        <polygon id="Line-Copy" points="1 0 1 9 0 9 0 0"></polygon>
                        <polygon id="Line-Copy" points="20 0 20 9 19 9 19 0"></polygon>
                    </g>
                    <rect id="Bg" fill-opacity="0.06" fill="#000000" x="0" y="52" width="354" height="2"></rect>
                    <polygon id="Line" fill="#CEC5CE" fill-rule="nonzero" points="348 0 348 47 349 47 349 0"></polygon>
                    <polygon id="Line-Copy" fill="#CEC5CE" fill-rule="nonzero" points="329 0 329 47 330 47 330 0"></polygon>
                    <polygon id="Line-Copy-3" fill="#CEC5CE" fill-rule="nonzero" points="310 0 310 47 311 47 311 0"></polygon>
                    <polygon id="Line-Copy-5" fill="#CEC5CE" fill-rule="nonzero" points="291 0 291 47 292 47 292 0"></polygon>
                    <polygon id="Line-Copy-7" fill="#CEC5CE" fill-rule="nonzero" points="272 0 272 47 273 47 273 0"></polygon>
                    <polygon id="Line-Copy-9" fill="#CEC5CE" fill-rule="nonzero" points="253 0 253 47 254 47 254 0"></polygon>
                    <polygon id="Line-Copy-11" fill="#CEC5CE" fill-rule="nonzero" points="234 0 234 47 235 47 235 0"></polygon>
                    <polygon id="Line-Copy-13" fill="#CEC5CE" fill-rule="nonzero" points="215 0 215 47 216 47 216 0"></polygon>
                    <polygon id="Line-Copy-15" fill="#CEC5CE" fill-rule="nonzero" points="196 0 196 47 197 47 197 0"></polygon>
                    <polygon id="Line-Copy-17" fill="#CEC5CE" fill-rule="nonzero" points="177 0 177 47 178 47 178 0"></polygon>
                    <polygon id="Line-Copy-19" fill="#CEC5CE" fill-rule="nonzero" points="158 0 158 47 159 47 159 0"></polygon>
                    <polygon id="Line-Copy-21" fill="#CEC5CE" fill-rule="nonzero" points="139 0 139 47 140 47 140 0"></polygon>
                    <polygon id="Line-Copy-23" fill="#CEC5CE" fill-rule="nonzero" points="120 0 120 47 121 47 121 0"></polygon>
                    <polygon id="Line-Copy-25" fill="#CEC5CE" fill-rule="nonzero" points="101 0 101 47 102 47 102 0"></polygon>
                    <polygon id="Line-Copy-27" fill="#CEC5CE" fill-rule="nonzero" points="82 0 82 47 83 47 83 0"></polygon>
                    <polygon id="Line-Copy-29" fill="#CEC5CE" fill-rule="nonzero" points="63 0 63 47 64 47 64 0"></polygon>
                    <polygon id="Line-Copy-31" fill="#CEC5CE" fill-rule="nonzero" points="44 0 44 47 45 47 45 0"></polygon>
                    <polygon id="Line-Copy" fill="#CEC5CE" fill-rule="nonzero" points="6 0 6 47 5 47 5 0"></polygon>
                    <polygon id="Line-Copy" fill="#CEC5CE" fill-rule="nonzero" points="25 0 25 47 24 47 24 0"></polygon>
                    <polygon id="Line-2" fill="#CEC5CE" fill-rule="nonzero" points="354 48 -2.84217094e-14 48 -2.84217094e-14 47 354 47"></polygon>
                    <polygon id="Line-2-Copy-2" fill="#CEC5CE" fill-rule="nonzero" points="354 22 -2.84217094e-14 22 -2.84217094e-14 21 354 21"></polygon>
                    <polygon id="Line-2" fill="#CEC5CE" fill-rule="nonzero" points="354 9 -2.84217094e-14 9 -2.84217094e-14 8 354 8"></polygon>
                    <polygon id="Line-2-Copy" fill="#CEC5CE" fill-rule="nonzero" points="354 35 -2.84217094e-14 35 -2.84217094e-14 34 354 34"></polygon>
                </g>
                <g id="Group-3" stroke-width="1" transform="translate(26.000000, 0.000000)">
                    <g id="Rectangle-4">
                        <use fill="#E1F2FB" fill-rule="evenodd" xlink:href="#path-40"></use>
                        <rect stroke="#CAD1DD" stroke-width="1" x="0.5" y="0.5" width="17" height="46"></rect>
                    </g>
                    <g id="Rectangle-4">
                        <use fill="#E1F2FB" fill-rule="evenodd" xlink:href="#path-41"></use>
                        <rect stroke="#CAD1DD" stroke-width="1" x="17.5" y="0.5" width="17" height="46"></rect>
                    </g>
                    <g id="Rectangle-4">
                        <use fill="#E1F2FB" fill-rule="evenodd" xlink:href="#path-42"></use>
                        <rect stroke="#CAD1DD" stroke-width="1" x="51.5" y="0.5" width="17" height="46"></rect>
                    </g>
                    <g id="Rectangle-4">
                        <use fill="#E1F2FB" fill-rule="evenodd" xlink:href="#path-43"></use>
                        <rect stroke="#CAD1DD" stroke-width="1" x="34.5" y="0.5" width="17" height="46"></rect>
                    </g>
                    <g id="Rectangle-4">
                        <use fill="#E1F2FB" fill-rule="evenodd" xlink:href="#path-44"></use>
                        <rect stroke="#CAD1DD" stroke-width="1" x="68.5" y="0.5" width="17" height="46"></rect>
                    </g>
                </g>
                <g id="Group-3-Copy-2" stroke-width="1" transform="translate(154.000000, 0.000000)">
                    <g id="Rectangle-4">
                        <use fill="#E1F2FB" fill-rule="evenodd" xlink:href="#path-45"></use>
                        <rect stroke="#CAD1DD" stroke-width="1" x="0.5" y="0.5" width="17" height="46"></rect>
                    </g>
                    <g id="Rectangle-4">
                        <use fill="#E1F2FB" fill-rule="evenodd" xlink:href="#path-46"></use>
                        <rect stroke="#CAD1DD" stroke-width="1" x="34.5" y="0.5" width="17" height="46"></rect>
                    </g>
                    <g id="Rectangle-4">
                        <use fill="#E1F2FB" fill-rule="evenodd" xlink:href="#path-47"></use>
                        <rect stroke="#CAD1DD" stroke-width="1" x="17.5" y="0.5" width="17" height="46"></rect>
                    </g>
                </g>
                <g id="Group-3-Copy" stroke-width="1" transform="translate(248.000000, 0.000000)">
                    <g id="Rectangle-4">
                        <use fill="#E1F2FB" fill-rule="evenodd" xlink:href="#path-48"></use>
                        <rect stroke="#CAD1DD" stroke-width="1" x="0.5" y="0.5" width="17" height="46"></rect>
                    </g>
                    <g id="Rectangle-4">
                        <use fill="#E1F2FB" fill-rule="evenodd" xlink:href="#path-49"></use>
                        <rect stroke="#CAD1DD" stroke-width="1" x="17.5" y="0.5" width="17" height="46"></rect>
                    </g>
                    <g id="Rectangle-4">
                        <use fill="#E1F2FB" fill-rule="evenodd" xlink:href="#path-50"></use>
                        <rect stroke="#CAD1DD" stroke-width="1" x="51.5" y="0.5" width="17" height="46"></rect>
                    </g>
                    <g id="Rectangle-4">
                        <use fill="#E1F2FB" fill-rule="evenodd" xlink:href="#path-51"></use>
                        <rect stroke="#CAD1DD" stroke-width="1" x="34.5" y="0.5" width="17" height="46"></rect>
                    </g>
                    <g id="Rectangle-4">
                        <use fill="#E1F2FB" fill-rule="evenodd" xlink:href="#path-52"></use>
                        <rect stroke="#CAD1DD" stroke-width="1" x="68.5" y="0.5" width="17" height="46"></rect>
                    </g>
                </g>
                <g id="Group-4" stroke-width="1" transform="translate(2.000000, 47.000000)">
                    <polygon id="Line-2-Copy-3" fill="#F0F2F7" fill-rule="nonzero" points="356 1 0 1 0 0 356 0"></polygon>
                    <polygon id="Line-2-Copy-4" fill="#CAD1DD" fill-rule="nonzero" points="355 2 1 2 1 1 355 1"></polygon>
                    <polygon id="Line-2-Copy-5" fill="#F0F2F7" fill-rule="nonzero" points="356 3 0 3 0 2 356 2"></polygon>
                    <polygon id="Line-2-Copy-7" fill="#F0F2F7" fill-rule="nonzero" points="356 5 0 5 0 4 356 4"></polygon>
                    <polygon id="Line-2-Copy-6" fill="#CAD1DD" fill-rule="nonzero" points="355 4 1 4 1 3 355 3"></polygon>
                </g>
                <rect id="Rectangle-13" fill-opacity="0.06" fill="#000000" x="3" y="0" width="354" height="5"></rect>
            </g>
            <g id="3F-4F" transform="translate(8.000000, 320.000000)">
                <g id="Group" stroke-width="1" transform="translate(3.000000, 0.000000)">
                    <rect id="Bg" fill="#E5E1E5" x="0" y="0" width="354" height="61"></rect>
                    <rect id="Bg" fill="#FCFBF3" x="0" y="52" width="354" height="9"></rect>
                    <g id="Group-2" transform="translate(5.000000, 52.000000)" fill-rule="nonzero" fill="#E1DFD2">
                        <polygon id="Line" points="343 0 343 9 344 9 344 0"></polygon>
                        <polygon id="Line-Copy" points="324 0 324 9 325 9 325 0"></polygon>
                        <polygon id="Line-Copy-2" points="305 0 305 9 306 9 306 0"></polygon>
                        <polygon id="Line-Copy-4" points="286 0 286 9 287 9 287 0"></polygon>
                        <polygon id="Line-Copy-6" points="267 0 267 9 268 9 268 0"></polygon>
                        <polygon id="Line-Copy-8" points="248 0 248 9 249 9 249 0"></polygon>
                        <polygon id="Line-Copy-10" points="229 0 229 9 230 9 230 0"></polygon>
                        <polygon id="Line-Copy-12" points="210 0 210 9 211 9 211 0"></polygon>
                        <polygon id="Line-Copy-14" points="191 0 191 9 192 9 192 0"></polygon>
                        <polygon id="Line-Copy-16" points="172 0 172 9 173 9 173 0"></polygon>
                        <polygon id="Line-Copy-18" points="153 0 153 9 154 9 154 0"></polygon>
                        <polygon id="Line-Copy-20" points="134 0 134 9 135 9 135 0"></polygon>
                        <polygon id="Line-Copy-22" points="115 0 115 9 116 9 116 0"></polygon>
                        <polygon id="Line-Copy-24" points="96 0 96 9 97 9 97 0"></polygon>
                        <polygon id="Line-Copy-26" points="77 0 77 9 78 9 78 0"></polygon>
                        <polygon id="Line-Copy-28" points="58 0 58 9 59 9 59 0"></polygon>
                        <polygon id="Line-Copy-30" points="39 0 39 9 40 9 40 0"></polygon>
                        <polygon id="Line-Copy" points="1 0 1 9 0 9 0 0"></polygon>
                        <polygon id="Line-Copy" points="20 0 20 9 19 9 19 0"></polygon>
                    </g>
                    <rect id="Bg" fill-opacity="0.06" fill="#000000" x="0" y="52" width="354" height="2"></rect>
                    <polygon id="Line" fill="#CEC5CE" fill-rule="nonzero" points="348 0 348 47 349 47 349 0"></polygon>
                    <polygon id="Line-Copy" fill="#CEC5CE" fill-rule="nonzero" points="329 0 329 47 330 47 330 0"></polygon>
                    <polygon id="Line-Copy-3" fill="#CEC5CE" fill-rule="nonzero" points="310 0 310 47 311 47 311 0"></polygon>
                    <polygon id="Line-Copy-5" fill="#CEC5CE" fill-rule="nonzero" points="291 0 291 47 292 47 292 0"></polygon>
                    <polygon id="Line-Copy-7" fill="#CEC5CE" fill-rule="nonzero" points="272 0 272 47 273 47 273 0"></polygon>
                    <polygon id="Line-Copy-9" fill="#CEC5CE" fill-rule="nonzero" points="253 0 253 47 254 47 254 0"></polygon>
                    <polygon id="Line-Copy-11" fill="#CEC5CE" fill-rule="nonzero" points="234 0 234 47 235 47 235 0"></polygon>
                    <polygon id="Line-Copy-13" fill="#CEC5CE" fill-rule="nonzero" points="215 0 215 47 216 47 216 0"></polygon>
                    <polygon id="Line-Copy-15" fill="#CEC5CE" fill-rule="nonzero" points="196 0 196 47 197 47 197 0"></polygon>
                    <polygon id="Line-Copy-17" fill="#CEC5CE" fill-rule="nonzero" points="177 0 177 47 178 47 178 0"></polygon>
                    <polygon id="Line-Copy-19" fill="#CEC5CE" fill-rule="nonzero" points="158 0 158 47 159 47 159 0"></polygon>
                    <polygon id="Line-Copy-21" fill="#CEC5CE" fill-rule="nonzero" points="139 0 139 47 140 47 140 0"></polygon>
                    <polygon id="Line-Copy-23" fill="#CEC5CE" fill-rule="nonzero" points="120 0 120 47 121 47 121 0"></polygon>
                    <polygon id="Line-Copy-25" fill="#CEC5CE" fill-rule="nonzero" points="101 0 101 47 102 47 102 0"></polygon>
                    <polygon id="Line-Copy-27" fill="#CEC5CE" fill-rule="nonzero" points="82 0 82 47 83 47 83 0"></polygon>
                    <polygon id="Line-Copy-29" fill="#CEC5CE" fill-rule="nonzero" points="63 0 63 47 64 47 64 0"></polygon>
                    <polygon id="Line-Copy-31" fill="#CEC5CE" fill-rule="nonzero" points="44 0 44 47 45 47 45 0"></polygon>
                    <polygon id="Line-Copy" fill="#CEC5CE" fill-rule="nonzero" points="6 0 6 47 5 47 5 0"></polygon>
                    <polygon id="Line-Copy" fill="#CEC5CE" fill-rule="nonzero" points="25 0 25 47 24 47 24 0"></polygon>
                    <polygon id="Line-2" fill="#CEC5CE" fill-rule="nonzero" points="354 48 -2.84217094e-14 48 -2.84217094e-14 47 354 47"></polygon>
                    <polygon id="Line-2-Copy-2" fill="#CEC5CE" fill-rule="nonzero" points="354 22 -2.84217094e-14 22 -2.84217094e-14 21 354 21"></polygon>
                    <polygon id="Line-2" fill="#CEC5CE" fill-rule="nonzero" points="354 9 -2.84217094e-14 9 -2.84217094e-14 8 354 8"></polygon>
                    <polygon id="Line-2-Copy" fill="#CEC5CE" fill-rule="nonzero" points="354 35 -2.84217094e-14 35 -2.84217094e-14 34 354 34"></polygon>
                </g>
                <g id="Group-3" stroke-width="1" transform="translate(26.000000, 0.000000)">
                    <g id="Rectangle-4">
                        <use fill="#E1F2FB" fill-rule="evenodd" xlink:href="#path-53"></use>
                        <rect stroke="#CAD1DD" stroke-width="1" x="0.5" y="0.5" width="17" height="46"></rect>
                    </g>
                    <g id="Rectangle-4">
                        <use fill="#E1F2FB" fill-rule="evenodd" xlink:href="#path-54"></use>
                        <rect stroke="#CAD1DD" stroke-width="1" x="17.5" y="0.5" width="17" height="46"></rect>
                    </g>
                    <g id="Rectangle-4">
                        <use fill="#E1F2FB" fill-rule="evenodd" xlink:href="#path-55"></use>
                        <rect stroke="#CAD1DD" stroke-width="1" x="51.5" y="0.5" width="17" height="46"></rect>
                    </g>
                    <g id="Rectangle-4">
                        <use fill="#E1F2FB" fill-rule="evenodd" xlink:href="#path-56"></use>
                        <rect stroke="#CAD1DD" stroke-width="1" x="34.5" y="0.5" width="17" height="46"></rect>
                    </g>
                    <g id="Rectangle-4">
                        <use fill="#E1F2FB" fill-rule="evenodd" xlink:href="#path-57"></use>
                        <rect stroke="#CAD1DD" stroke-width="1" x="68.5" y="0.5" width="17" height="46"></rect>
                    </g>
                </g>
                <g id="Group-3-Copy-2" stroke-width="1" transform="translate(154.000000, 0.000000)">
                    <g id="Rectangle-4">
                        <use fill="#E1F2FB" fill-rule="evenodd" xlink:href="#path-58"></use>
                        <rect stroke="#CAD1DD" stroke-width="1" x="0.5" y="0.5" width="17" height="46"></rect>
                    </g>
                    <g id="Rectangle-4">
                        <use fill="#E1F2FB" fill-rule="evenodd" xlink:href="#path-59"></use>
                        <rect stroke="#CAD1DD" stroke-width="1" x="34.5" y="0.5" width="17" height="46"></rect>
                    </g>
                    <g id="Rectangle-4">
                        <use fill="#E1F2FB" fill-rule="evenodd" xlink:href="#path-60"></use>
                        <rect stroke="#CAD1DD" stroke-width="1" x="17.5" y="0.5" width="17" height="46"></rect>
                    </g>
                </g>
                <g id="Group-3-Copy" stroke-width="1" transform="translate(248.000000, 0.000000)">
                    <g id="Rectangle-4">
                        <use fill="#E1F2FB" fill-rule="evenodd" xlink:href="#path-61"></use>
                        <rect stroke="#CAD1DD" stroke-width="1" x="0.5" y="0.5" width="17" height="46"></rect>
                    </g>
                    <g id="Rectangle-4">
                        <use fill="#E1F2FB" fill-rule="evenodd" xlink:href="#path-62"></use>
                        <rect stroke="#CAD1DD" stroke-width="1" x="17.5" y="0.5" width="17" height="46"></rect>
                    </g>
                    <g id="Rectangle-4">
                        <use fill="#E1F2FB" fill-rule="evenodd" xlink:href="#path-63"></use>
                        <rect stroke="#CAD1DD" stroke-width="1" x="51.5" y="0.5" width="17" height="46"></rect>
                    </g>
                    <g id="Rectangle-4">
                        <use fill="#E1F2FB" fill-rule="evenodd" xlink:href="#path-64"></use>
                        <rect stroke="#CAD1DD" stroke-width="1" x="34.5" y="0.5" width="17" height="46"></rect>
                    </g>
                    <g id="Rectangle-4">
                        <use fill="#E1F2FB" fill-rule="evenodd" xlink:href="#path-65"></use>
                        <rect stroke="#CAD1DD" stroke-width="1" x="68.5" y="0.5" width="17" height="46"></rect>
                    </g>
                </g>
                <g id="Group-4" stroke-width="1" transform="translate(2.000000, 47.000000)">
                    <polygon id="Line-2-Copy-3" fill="#F0F2F7" fill-rule="nonzero" points="356 1 0 1 0 0 356 0"></polygon>
                    <polygon id="Line-2-Copy-4" fill="#CAD1DD" fill-rule="nonzero" points="355 2 1 2 1 1 355 1"></polygon>
                    <polygon id="Line-2-Copy-5" fill="#F0F2F7" fill-rule="nonzero" points="356 3 0 3 0 2 356 2"></polygon>
                    <polygon id="Line-2-Copy-7" fill="#F0F2F7" fill-rule="nonzero" points="356 5 0 5 0 4 356 4"></polygon>
                    <polygon id="Line-2-Copy-6" fill="#CAD1DD" fill-rule="nonzero" points="355 4 1 4 1 3 355 3"></polygon>
                </g>
                <rect id="Rectangle-13" fill-opacity="0.06" fill="#000000" x="3" y="0" width="354" height="5"></rect>
            </g>
            <g id="3F-4F" transform="translate(8.000000, 259.000000)">
                <g id="Group" stroke-width="1" transform="translate(3.000000, 0.000000)">
                    <rect id="Bg" fill="#E5E1E5" x="0" y="0" width="354" height="61"></rect>
                    <rect id="Bg" fill="#FCFBF3" x="0" y="52" width="354" height="9"></rect>
                    <g id="Group-2" transform="translate(5.000000, 52.000000)" fill-rule="nonzero" fill="#E1DFD2">
                        <polygon id="Line" points="343 0 343 9 344 9 344 0"></polygon>
                        <polygon id="Line-Copy" points="324 0 324 9 325 9 325 0"></polygon>
                        <polygon id="Line-Copy-2" points="305 0 305 9 306 9 306 0"></polygon>
                        <polygon id="Line-Copy-4" points="286 0 286 9 287 9 287 0"></polygon>
                        <polygon id="Line-Copy-6" points="267 0 267 9 268 9 268 0"></polygon>
                        <polygon id="Line-Copy-8" points="248 0 248 9 249 9 249 0"></polygon>
                        <polygon id="Line-Copy-10" points="229 0 229 9 230 9 230 0"></polygon>
                        <polygon id="Line-Copy-12" points="210 0 210 9 211 9 211 0"></polygon>
                        <polygon id="Line-Copy-14" points="191 0 191 9 192 9 192 0"></polygon>
                        <polygon id="Line-Copy-16" points="172 0 172 9 173 9 173 0"></polygon>
                        <polygon id="Line-Copy-18" points="153 0 153 9 154 9 154 0"></polygon>
                        <polygon id="Line-Copy-20" points="134 0 134 9 135 9 135 0"></polygon>
                        <polygon id="Line-Copy-22" points="115 0 115 9 116 9 116 0"></polygon>
                        <polygon id="Line-Copy-24" points="96 0 96 9 97 9 97 0"></polygon>
                        <polygon id="Line-Copy-26" points="77 0 77 9 78 9 78 0"></polygon>
                        <polygon id="Line-Copy-28" points="58 0 58 9 59 9 59 0"></polygon>
                        <polygon id="Line-Copy-30" points="39 0 39 9 40 9 40 0"></polygon>
                        <polygon id="Line-Copy" points="1 0 1 9 0 9 0 0"></polygon>
                        <polygon id="Line-Copy" points="20 0 20 9 19 9 19 0"></polygon>
                    </g>
                    <rect id="Bg" fill-opacity="0.06" fill="#000000" x="0" y="52" width="354" height="2"></rect>
                    <polygon id="Line" fill="#CEC5CE" fill-rule="nonzero" points="348 0 348 47 349 47 349 0"></polygon>
                    <polygon id="Line-Copy" fill="#CEC5CE" fill-rule="nonzero" points="329 0 329 47 330 47 330 0"></polygon>
                    <polygon id="Line-Copy-3" fill="#CEC5CE" fill-rule="nonzero" points="310 0 310 47 311 47 311 0"></polygon>
                    <polygon id="Line-Copy-5" fill="#CEC5CE" fill-rule="nonzero" points="291 0 291 47 292 47 292 0"></polygon>
                    <polygon id="Line-Copy-7" fill="#CEC5CE" fill-rule="nonzero" points="272 0 272 47 273 47 273 0"></polygon>
                    <polygon id="Line-Copy-9" fill="#CEC5CE" fill-rule="nonzero" points="253 0 253 47 254 47 254 0"></polygon>
                    <polygon id="Line-Copy-11" fill="#CEC5CE" fill-rule="nonzero" points="234 0 234 47 235 47 235 0"></polygon>
                    <polygon id="Line-Copy-13" fill="#CEC5CE" fill-rule="nonzero" points="215 0 215 47 216 47 216 0"></polygon>
                    <polygon id="Line-Copy-15" fill="#CEC5CE" fill-rule="nonzero" points="196 0 196 47 197 47 197 0"></polygon>
                    <polygon id="Line-Copy-17" fill="#CEC5CE" fill-rule="nonzero" points="177 0 177 47 178 47 178 0"></polygon>
                    <polygon id="Line-Copy-19" fill="#CEC5CE" fill-rule="nonzero" points="158 0 158 47 159 47 159 0"></polygon>
                    <polygon id="Line-Copy-21" fill="#CEC5CE" fill-rule="nonzero" points="139 0 139 47 140 47 140 0"></polygon>
                    <polygon id="Line-Copy-23" fill="#CEC5CE" fill-rule="nonzero" points="120 0 120 47 121 47 121 0"></polygon>
                    <polygon id="Line-Copy-25" fill="#CEC5CE" fill-rule="nonzero" points="101 0 101 47 102 47 102 0"></polygon>
                    <polygon id="Line-Copy-27" fill="#CEC5CE" fill-rule="nonzero" points="82 0 82 47 83 47 83 0"></polygon>
                    <polygon id="Line-Copy-29" fill="#CEC5CE" fill-rule="nonzero" points="63 0 63 47 64 47 64 0"></polygon>
                    <polygon id="Line-Copy-31" fill="#CEC5CE" fill-rule="nonzero" points="44 0 44 47 45 47 45 0"></polygon>
                    <polygon id="Line-Copy" fill="#CEC5CE" fill-rule="nonzero" points="6 0 6 47 5 47 5 0"></polygon>
                    <polygon id="Line-Copy" fill="#CEC5CE" fill-rule="nonzero" points="25 0 25 47 24 47 24 0"></polygon>
                    <polygon id="Line-2" fill="#CEC5CE" fill-rule="nonzero" points="354 48 -2.84217094e-14 48 -2.84217094e-14 47 354 47"></polygon>
                    <polygon id="Line-2-Copy-2" fill="#CEC5CE" fill-rule="nonzero" points="354 22 -2.84217094e-14 22 -2.84217094e-14 21 354 21"></polygon>
                    <polygon id="Line-2" fill="#CEC5CE" fill-rule="nonzero" points="354 9 -2.84217094e-14 9 -2.84217094e-14 8 354 8"></polygon>
                    <polygon id="Line-2-Copy" fill="#CEC5CE" fill-rule="nonzero" points="354 35 -2.84217094e-14 35 -2.84217094e-14 34 354 34"></polygon>
                </g>
                <g id="Group-3" stroke-width="1" transform="translate(26.000000, 0.000000)">
                    <g id="Rectangle-4">
                        <use fill="#E1F2FB" fill-rule="evenodd" xlink:href="#path-66"></use>
                        <rect stroke="#CAD1DD" stroke-width="1" x="0.5" y="0.5" width="17" height="46"></rect>
                    </g>
                    <g id="Rectangle-4">
                        <use fill="#E1F2FB" fill-rule="evenodd" xlink:href="#path-67"></use>
                        <rect stroke="#CAD1DD" stroke-width="1" x="17.5" y="0.5" width="17" height="46"></rect>
                    </g>
                    <g id="Rectangle-4">
                        <use fill="#E1F2FB" fill-rule="evenodd" xlink:href="#path-68"></use>
                        <rect stroke="#CAD1DD" stroke-width="1" x="51.5" y="0.5" width="17" height="46"></rect>
                    </g>
                    <g id="Rectangle-4">
                        <use fill="#E1F2FB" fill-rule="evenodd" xlink:href="#path-69"></use>
                        <rect stroke="#CAD1DD" stroke-width="1" x="34.5" y="0.5" width="17" height="46"></rect>
                    </g>
                    <g id="Rectangle-4">
                        <use fill="#E1F2FB" fill-rule="evenodd" xlink:href="#path-70"></use>
                        <rect stroke="#CAD1DD" stroke-width="1" x="68.5" y="0.5" width="17" height="46"></rect>
                    </g>
                </g>
                <g id="Group-3-Copy-2" stroke-width="1" transform="translate(154.000000, 0.000000)">
                    <g id="Rectangle-4">
                        <use fill="#E1F2FB" fill-rule="evenodd" xlink:href="#path-71"></use>
                        <rect stroke="#CAD1DD" stroke-width="1" x="0.5" y="0.5" width="17" height="46"></rect>
                    </g>
                    <g id="Rectangle-4">
                        <use fill="#E1F2FB" fill-rule="evenodd" xlink:href="#path-72"></use>
                        <rect stroke="#CAD1DD" stroke-width="1" x="34.5" y="0.5" width="17" height="46"></rect>
                    </g>
                    <g id="Rectangle-4">
                        <use fill="#E1F2FB" fill-rule="evenodd" xlink:href="#path-73"></use>
                        <rect stroke="#CAD1DD" stroke-width="1" x="17.5" y="0.5" width="17" height="46"></rect>
                    </g>
                </g>
                <g id="Group-3-Copy" stroke-width="1" transform="translate(248.000000, 0.000000)">
                    <g id="Rectangle-4">
                        <use fill="#E1F2FB" fill-rule="evenodd" xlink:href="#path-74"></use>
                        <rect stroke="#CAD1DD" stroke-width="1" x="0.5" y="0.5" width="17" height="46"></rect>
                    </g>
                    <g id="Rectangle-4">
                        <use fill="#E1F2FB" fill-rule="evenodd" xlink:href="#path-75"></use>
                        <rect stroke="#CAD1DD" stroke-width="1" x="17.5" y="0.5" width="17" height="46"></rect>
                    </g>
                    <g id="Rectangle-4">
                        <use fill="#E1F2FB" fill-rule="evenodd" xlink:href="#path-76"></use>
                        <rect stroke="#CAD1DD" stroke-width="1" x="51.5" y="0.5" width="17" height="46"></rect>
                    </g>
                    <g id="Rectangle-4">
                        <use fill="#E1F2FB" fill-rule="evenodd" xlink:href="#path-77"></use>
                        <rect stroke="#CAD1DD" stroke-width="1" x="34.5" y="0.5" width="17" height="46"></rect>
                    </g>
                    <g id="Rectangle-4">
                        <use fill="#E1F2FB" fill-rule="evenodd" xlink:href="#path-78"></use>
                        <rect stroke="#CAD1DD" stroke-width="1" x="68.5" y="0.5" width="17" height="46"></rect>
                    </g>
                </g>
                <g id="Group-4" stroke-width="1" transform="translate(2.000000, 47.000000)">
                    <polygon id="Line-2-Copy-3" fill="#F0F2F7" fill-rule="nonzero" points="356 1 0 1 0 0 356 0"></polygon>
                    <polygon id="Line-2-Copy-4" fill="#CAD1DD" fill-rule="nonzero" points="355 2 1 2 1 1 355 1"></polygon>
                    <polygon id="Line-2-Copy-5" fill="#F0F2F7" fill-rule="nonzero" points="356 3 0 3 0 2 356 2"></polygon>
                    <polygon id="Line-2-Copy-7" fill="#F0F2F7" fill-rule="nonzero" points="356 5 0 5 0 4 356 4"></polygon>
                    <polygon id="Line-2-Copy-6" fill="#CAD1DD" fill-rule="nonzero" points="355 4 1 4 1 3 355 3"></polygon>
                </g>
                <rect id="Rectangle-13" fill-opacity="0.06" fill="#000000" x="3" y="0" width="354" height="5"></rect>
            </g>
            <g id="3F-4F" transform="translate(8.000000, 198.000000)">
                <g id="Group" stroke-width="1" transform="translate(3.000000, 0.000000)">
                    <rect id="Bg" fill="#E5E1E5" x="0" y="0" width="354" height="61"></rect>
                    <rect id="Bg" fill="#FCFBF3" x="0" y="52" width="354" height="9"></rect>
                    <g id="Group-2" transform="translate(5.000000, 52.000000)" fill-rule="nonzero" fill="#E1DFD2">
                        <polygon id="Line" points="343 0 343 9 344 9 344 0"></polygon>
                        <polygon id="Line-Copy" points="324 0 324 9 325 9 325 0"></polygon>
                        <polygon id="Line-Copy-2" points="305 0 305 9 306 9 306 0"></polygon>
                        <polygon id="Line-Copy-4" points="286 0 286 9 287 9 287 0"></polygon>
                        <polygon id="Line-Copy-6" points="267 0 267 9 268 9 268 0"></polygon>
                        <polygon id="Line-Copy-8" points="248 0 248 9 249 9 249 0"></polygon>
                        <polygon id="Line-Copy-10" points="229 0 229 9 230 9 230 0"></polygon>
                        <polygon id="Line-Copy-12" points="210 0 210 9 211 9 211 0"></polygon>
                        <polygon id="Line-Copy-14" points="191 0 191 9 192 9 192 0"></polygon>
                        <polygon id="Line-Copy-16" points="172 0 172 9 173 9 173 0"></polygon>
                        <polygon id="Line-Copy-18" points="153 0 153 9 154 9 154 0"></polygon>
                        <polygon id="Line-Copy-20" points="134 0 134 9 135 9 135 0"></polygon>
                        <polygon id="Line-Copy-22" points="115 0 115 9 116 9 116 0"></polygon>
                        <polygon id="Line-Copy-24" points="96 0 96 9 97 9 97 0"></polygon>
                        <polygon id="Line-Copy-26" points="77 0 77 9 78 9 78 0"></polygon>
                        <polygon id="Line-Copy-28" points="58 0 58 9 59 9 59 0"></polygon>
                        <polygon id="Line-Copy-30" points="39 0 39 9 40 9 40 0"></polygon>
                        <polygon id="Line-Copy" points="1 0 1 9 0 9 0 0"></polygon>
                        <polygon id="Line-Copy" points="20 0 20 9 19 9 19 0"></polygon>
                    </g>
                    <rect id="Bg" fill-opacity="0.06" fill="#000000" x="0" y="52" width="354" height="2"></rect>
                    <polygon id="Line" fill="#CEC5CE" fill-rule="nonzero" points="348 0 348 47 349 47 349 0"></polygon>
                    <polygon id="Line-Copy" fill="#CEC5CE" fill-rule="nonzero" points="329 0 329 47 330 47 330 0"></polygon>
                    <polygon id="Line-Copy-3" fill="#CEC5CE" fill-rule="nonzero" points="310 0 310 47 311 47 311 0"></polygon>
                    <polygon id="Line-Copy-5" fill="#CEC5CE" fill-rule="nonzero" points="291 0 291 47 292 47 292 0"></polygon>
                    <polygon id="Line-Copy-7" fill="#CEC5CE" fill-rule="nonzero" points="272 0 272 47 273 47 273 0"></polygon>
                    <polygon id="Line-Copy-9" fill="#CEC5CE" fill-rule="nonzero" points="253 0 253 47 254 47 254 0"></polygon>
                    <polygon id="Line-Copy-11" fill="#CEC5CE" fill-rule="nonzero" points="234 0 234 47 235 47 235 0"></polygon>
                    <polygon id="Line-Copy-13" fill="#CEC5CE" fill-rule="nonzero" points="215 0 215 47 216 47 216 0"></polygon>
                    <polygon id="Line-Copy-15" fill="#CEC5CE" fill-rule="nonzero" points="196 0 196 47 197 47 197 0"></polygon>
                    <polygon id="Line-Copy-17" fill="#CEC5CE" fill-rule="nonzero" points="177 0 177 47 178 47 178 0"></polygon>
                    <polygon id="Line-Copy-19" fill="#CEC5CE" fill-rule="nonzero" points="158 0 158 47 159 47 159 0"></polygon>
                    <polygon id="Line-Copy-21" fill="#CEC5CE" fill-rule="nonzero" points="139 0 139 47 140 47 140 0"></polygon>
                    <polygon id="Line-Copy-23" fill="#CEC5CE" fill-rule="nonzero" points="120 0 120 47 121 47 121 0"></polygon>
                    <polygon id="Line-Copy-25" fill="#CEC5CE" fill-rule="nonzero" points="101 0 101 47 102 47 102 0"></polygon>
                    <polygon id="Line-Copy-27" fill="#CEC5CE" fill-rule="nonzero" points="82 0 82 47 83 47 83 0"></polygon>
                    <polygon id="Line-Copy-29" fill="#CEC5CE" fill-rule="nonzero" points="63 0 63 47 64 47 64 0"></polygon>
                    <polygon id="Line-Copy-31" fill="#CEC5CE" fill-rule="nonzero" points="44 0 44 47 45 47 45 0"></polygon>
                    <polygon id="Line-Copy" fill="#CEC5CE" fill-rule="nonzero" points="6 0 6 47 5 47 5 0"></polygon>
                    <polygon id="Line-Copy" fill="#CEC5CE" fill-rule="nonzero" points="25 0 25 47 24 47 24 0"></polygon>
                    <polygon id="Line-2" fill="#CEC5CE" fill-rule="nonzero" points="354 48 -2.84217094e-14 48 -2.84217094e-14 47 354 47"></polygon>
                    <polygon id="Line-2-Copy-2" fill="#CEC5CE" fill-rule="nonzero" points="354 22 -2.84217094e-14 22 -2.84217094e-14 21 354 21"></polygon>
                    <polygon id="Line-2" fill="#CEC5CE" fill-rule="nonzero" points="354 9 -2.84217094e-14 9 -2.84217094e-14 8 354 8"></polygon>
                    <polygon id="Line-2-Copy" fill="#CEC5CE" fill-rule="nonzero" points="354 35 -2.84217094e-14 35 -2.84217094e-14 34 354 34"></polygon>
                </g>
                <g id="Group-3" stroke-width="1" transform="translate(26.000000, 0.000000)">
                    <g id="Rectangle-4">
                        <use fill="#E1F2FB" fill-rule="evenodd" xlink:href="#path-79"></use>
                        <rect stroke="#CAD1DD" stroke-width="1" x="0.5" y="0.5" width="17" height="46"></rect>
                    </g>
                    <g id="Rectangle-4">
                        <use fill="#E1F2FB" fill-rule="evenodd" xlink:href="#path-80"></use>
                        <rect stroke="#CAD1DD" stroke-width="1" x="17.5" y="0.5" width="17" height="46"></rect>
                    </g>
                    <g id="Rectangle-4">
                        <use fill="#E1F2FB" fill-rule="evenodd" xlink:href="#path-81"></use>
                        <rect stroke="#CAD1DD" stroke-width="1" x="51.5" y="0.5" width="17" height="46"></rect>
                    </g>
                    <g id="Rectangle-4">
                        <use fill="#E1F2FB" fill-rule="evenodd" xlink:href="#path-82"></use>
                        <rect stroke="#CAD1DD" stroke-width="1" x="34.5" y="0.5" width="17" height="46"></rect>
                    </g>
                    <g id="Rectangle-4">
                        <use fill="#E1F2FB" fill-rule="evenodd" xlink:href="#path-83"></use>
                        <rect stroke="#CAD1DD" stroke-width="1" x="68.5" y="0.5" width="17" height="46"></rect>
                    </g>
                </g>
                <g id="Group-3-Copy-2" stroke-width="1" transform="translate(154.000000, 0.000000)">
                    <g id="Rectangle-4">
                        <use fill="#E1F2FB" fill-rule="evenodd" xlink:href="#path-84"></use>
                        <rect stroke="#CAD1DD" stroke-width="1" x="0.5" y="0.5" width="17" height="46"></rect>
                    </g>
                    <g id="Rectangle-4">
                        <use fill="#E1F2FB" fill-rule="evenodd" xlink:href="#path-85"></use>
                        <rect stroke="#CAD1DD" stroke-width="1" x="34.5" y="0.5" width="17" height="46"></rect>
                    </g>
                    <g id="Rectangle-4">
                        <use fill="#E1F2FB" fill-rule="evenodd" xlink:href="#path-86"></use>
                        <rect stroke="#CAD1DD" stroke-width="1" x="17.5" y="0.5" width="17" height="46"></rect>
                    </g>
                </g>
                <g id="Group-3-Copy" stroke-width="1" transform="translate(248.000000, 0.000000)">
                    <g id="Rectangle-4">
                        <use fill="#E1F2FB" fill-rule="evenodd" xlink:href="#path-87"></use>
                        <rect stroke="#CAD1DD" stroke-width="1" x="0.5" y="0.5" width="17" height="46"></rect>
                    </g>
                    <g id="Rectangle-4">
                        <use fill="#E1F2FB" fill-rule="evenodd" xlink:href="#path-88"></use>
                        <rect stroke="#CAD1DD" stroke-width="1" x="17.5" y="0.5" width="17" height="46"></rect>
                    </g>
                    <g id="Rectangle-4">
                        <use fill="#E1F2FB" fill-rule="evenodd" xlink:href="#path-89"></use>
                        <rect stroke="#CAD1DD" stroke-width="1" x="51.5" y="0.5" width="17" height="46"></rect>
                    </g>
                    <g id="Rectangle-4">
                        <use fill="#E1F2FB" fill-rule="evenodd" xlink:href="#path-90"></use>
                        <rect stroke="#CAD1DD" stroke-width="1" x="34.5" y="0.5" width="17" height="46"></rect>
                    </g>
                    <g id="Rectangle-4">
                        <use fill="#E1F2FB" fill-rule="evenodd" xlink:href="#path-91"></use>
                        <rect stroke="#CAD1DD" stroke-width="1" x="68.5" y="0.5" width="17" height="46"></rect>
                    </g>
                </g>
                <g id="Group-4" stroke-width="1" transform="translate(2.000000, 47.000000)">
                    <polygon id="Line-2-Copy-3" fill="#F0F2F7" fill-rule="nonzero" points="356 1 0 1 0 0 356 0"></polygon>
                    <polygon id="Line-2-Copy-4" fill="#CAD1DD" fill-rule="nonzero" points="355 2 1 2 1 1 355 1"></polygon>
                    <polygon id="Line-2-Copy-5" fill="#F0F2F7" fill-rule="nonzero" points="356 3 0 3 0 2 356 2"></polygon>
                    <polygon id="Line-2-Copy-7" fill="#F0F2F7" fill-rule="nonzero" points="356 5 0 5 0 4 356 4"></polygon>
                    <polygon id="Line-2-Copy-6" fill="#CAD1DD" fill-rule="nonzero" points="355 4 1 4 1 3 355 3"></polygon>
                </g>
                <rect id="Rectangle-13" fill-opacity="0.06" fill="#000000" x="3" y="0" width="354" height="5"></rect>
            </g>
            <g id="Group-4" transform="translate(10.000000, 86.000000)">
                <g id="4F-Copy-5" transform="translate(1.000000, 19.000000)">
                    <g id="Group">
                        <rect id="Bg" fill="#E5E1E5" x="0" y="0" width="354" height="61"></rect>
                        <rect id="Bg" fill-opacity="0.03" fill="#000000" x="0" y="0" width="354" height="2"></rect>
                        <polygon id="Line" fill="#CEC5CE" fill-rule="nonzero" points="348 0 348 61 349 61 349 0"></polygon>
                        <polygon id="Line-Copy" fill="#CEC5CE" fill-rule="nonzero" points="329 0 329 61 330 61 330 0"></polygon>
                        <polygon id="Line-Copy" fill="#CEC5CE" fill-rule="nonzero" points="6 0 6 61 5 61 5 0"></polygon>
                        <polygon id="Line-Copy" fill="#CEC5CE" fill-rule="nonzero" points="25 0 25 61 24 61 24 0"></polygon>
                        <polygon id="Line-2" fill="#CEC5CE" fill-rule="nonzero" points="354 48 -2.84217094e-14 48 -2.84217094e-14 47 354 47"></polygon>
                        <polygon id="Line-2-Copy-2" fill="#CEC5CE" fill-rule="nonzero" points="354 22 -2.84217094e-14 22 -2.84217094e-14 21 354 21"></polygon>
                        <polygon id="Line-2" fill="#CEC5CE" fill-rule="nonzero" points="354 9 -2.84217094e-14 9 -2.84217094e-14 8 354 8"></polygon>
                        <polygon id="Line-2-Copy" fill="#CEC5CE" fill-rule="nonzero" points="354 35 -2.84217094e-14 35 -2.84217094e-14 34 354 34"></polygon>
                    </g>
                </g>
                <g id="Group-2" transform="translate(0.000000, 14.000000)" fill-rule="nonzero">
                    <polygon id="Line-2-Copy-3" fill="#F0F2F7" points="356 1 0 1 0 0 356 0"></polygon>
                    <polygon id="Line-2-Copy-4" fill="#CAD1DD" points="355 2 1 2 1 1 355 1"></polygon>
                    <polygon id="Line-2-Copy-5" fill="#F0F2F7" points="356 3 0 3 0 2 356 2"></polygon>
                    <polygon id="Line-2-Copy-7" fill="#F0F2F7" points="356 5 0 5 0 4 356 4"></polygon>
                    <polygon id="Line-2-Copy-6" fill="#CAD1DD" points="355 4 1 4 1 3 355 3"></polygon>
                </g>
                <g id="Group" transform="translate(1.000000, 0.000000)" fill="#CAD1DD">
                    <rect id="Rectangle-5" x="0" y="0" width="354" height="3"></rect>
                    <rect id="Rectangle-5" x="0" y="7" width="354" height="3"></rect>
                    <rect id="Rectangle-6" x="0" y="3" width="3" height="11"></rect>
                    <rect id="Rectangle-6" x="351" y="3" width="3" height="11"></rect>
                    <rect id="Rectangle-6-Copy" x="322" y="3" width="3" height="11"></rect>
                    <rect id="Rectangle-6-Copy-2" x="293" y="3" width="3" height="11"></rect>
                    <rect id="Rectangle-6-Copy-3" x="263" y="3" width="3" height="11"></rect>
                    <rect id="Rectangle-6-Copy-4" x="234" y="3" width="3" height="11"></rect>
                    <rect id="Rectangle-6-Copy-5" x="205" y="3" width="3" height="11"></rect>
                    <rect id="Rectangle-6-Copy-6" x="175" y="3" width="3" height="11"></rect>
                    <rect id="Rectangle-6-Copy-7" x="146" y="3" width="3" height="11"></rect>
                    <rect id="Rectangle-6-Copy-8" x="117" y="3" width="3" height="11"></rect>
                    <rect id="Rectangle-6-Copy-9" x="87" y="3" width="3" height="11"></rect>
                    <rect id="Rectangle-6-Copy-10" x="58" y="3" width="3" height="11"></rect>
                    <rect id="Rectangle-6-Copy-11" x="29" y="3" width="3" height="11"></rect>
                </g>
            </g>
            <g id="3F-4F" transform="translate(8.000000, 136.000000)">
                <g id="Group" stroke-width="1" transform="translate(3.000000, 0.000000)">
                    <rect id="Bg" fill="#E5E1E5" x="0" y="0" width="354" height="61"></rect>
                    <rect id="Bg" fill="#FCFBF3" x="0" y="52" width="354" height="9"></rect>
                    <g id="Group-2" transform="translate(5.000000, 52.000000)" fill-rule="nonzero" fill="#E1DFD2">
                        <polygon id="Line" points="343 0 343 9 344 9 344 0"></polygon>
                        <polygon id="Line-Copy" points="324 0 324 9 325 9 325 0"></polygon>
                        <polygon id="Line-Copy-2" points="305 0 305 9 306 9 306 0"></polygon>
                        <polygon id="Line-Copy-4" points="286 0 286 9 287 9 287 0"></polygon>
                        <polygon id="Line-Copy-6" points="267 0 267 9 268 9 268 0"></polygon>
                        <polygon id="Line-Copy-8" points="248 0 248 9 249 9 249 0"></polygon>
                        <polygon id="Line-Copy-10" points="229 0 229 9 230 9 230 0"></polygon>
                        <polygon id="Line-Copy-12" points="210 0 210 9 211 9 211 0"></polygon>
                        <polygon id="Line-Copy-14" points="191 0 191 9 192 9 192 0"></polygon>
                        <polygon id="Line-Copy-16" points="172 0 172 9 173 9 173 0"></polygon>
                        <polygon id="Line-Copy-18" points="153 0 153 9 154 9 154 0"></polygon>
                        <polygon id="Line-Copy-20" points="134 0 134 9 135 9 135 0"></polygon>
                        <polygon id="Line-Copy-22" points="115 0 115 9 116 9 116 0"></polygon>
                        <polygon id="Line-Copy-24" points="96 0 96 9 97 9 97 0"></polygon>
                        <polygon id="Line-Copy-26" points="77 0 77 9 78 9 78 0"></polygon>
                        <polygon id="Line-Copy-28" points="58 0 58 9 59 9 59 0"></polygon>
                        <polygon id="Line-Copy-30" points="39 0 39 9 40 9 40 0"></polygon>
                        <polygon id="Line-Copy" points="1 0 1 9 0 9 0 0"></polygon>
                        <polygon id="Line-Copy" points="20 0 20 9 19 9 19 0"></polygon>
                    </g>
                    <rect id="Bg" fill-opacity="0.06" fill="#000000" x="0" y="52" width="354" height="2"></rect>
                    <polygon id="Line" fill="#CEC5CE" fill-rule="nonzero" points="348 0 348 47 349 47 349 0"></polygon>
                    <polygon id="Line-Copy" fill="#CEC5CE" fill-rule="nonzero" points="329 0 329 47 330 47 330 0"></polygon>
                    <polygon id="Line-Copy-3" fill="#CEC5CE" fill-rule="nonzero" points="310 0 310 47 311 47 311 0"></polygon>
                    <polygon id="Line-Copy-5" fill="#CEC5CE" fill-rule="nonzero" points="291 0 291 47 292 47 292 0"></polygon>
                    <polygon id="Line-Copy-7" fill="#CEC5CE" fill-rule="nonzero" points="272 0 272 47 273 47 273 0"></polygon>
                    <polygon id="Line-Copy-9" fill="#CEC5CE" fill-rule="nonzero" points="253 0 253 47 254 47 254 0"></polygon>
                    <polygon id="Line-Copy-11" fill="#CEC5CE" fill-rule="nonzero" points="234 0 234 47 235 47 235 0"></polygon>
                    <polygon id="Line-Copy-13" fill="#CEC5CE" fill-rule="nonzero" points="215 0 215 47 216 47 216 0"></polygon>
                    <polygon id="Line-Copy-15" fill="#CEC5CE" fill-rule="nonzero" points="196 0 196 47 197 47 197 0"></polygon>
                    <polygon id="Line-Copy-17" fill="#CEC5CE" fill-rule="nonzero" points="177 0 177 47 178 47 178 0"></polygon>
                    <polygon id="Line-Copy-19" fill="#CEC5CE" fill-rule="nonzero" points="158 0 158 47 159 47 159 0"></polygon>
                    <polygon id="Line-Copy-21" fill="#CEC5CE" fill-rule="nonzero" points="139 0 139 47 140 47 140 0"></polygon>
                    <polygon id="Line-Copy-23" fill="#CEC5CE" fill-rule="nonzero" points="120 0 120 47 121 47 121 0"></polygon>
                    <polygon id="Line-Copy-25" fill="#CEC5CE" fill-rule="nonzero" points="101 0 101 47 102 47 102 0"></polygon>
                    <polygon id="Line-Copy-27" fill="#CEC5CE" fill-rule="nonzero" points="82 0 82 47 83 47 83 0"></polygon>
                    <polygon id="Line-Copy-29" fill="#CEC5CE" fill-rule="nonzero" points="63 0 63 47 64 47 64 0"></polygon>
                    <polygon id="Line-Copy-31" fill="#CEC5CE" fill-rule="nonzero" points="44 0 44 47 45 47 45 0"></polygon>
                    <polygon id="Line-Copy" fill="#CEC5CE" fill-rule="nonzero" points="6 0 6 47 5 47 5 0"></polygon>
                    <polygon id="Line-Copy" fill="#CEC5CE" fill-rule="nonzero" points="25 0 25 47 24 47 24 0"></polygon>
                    <polygon id="Line-2" fill="#CEC5CE" fill-rule="nonzero" points="354 48 -2.84217094e-14 48 -2.84217094e-14 47 354 47"></polygon>
                    <polygon id="Line-2-Copy-2" fill="#CEC5CE" fill-rule="nonzero" points="354 22 -2.84217094e-14 22 -2.84217094e-14 21 354 21"></polygon>
                    <polygon id="Line-2" fill="#CEC5CE" fill-rule="nonzero" points="354 9 -2.84217094e-14 9 -2.84217094e-14 8 354 8"></polygon>
                    <polygon id="Line-2-Copy" fill="#CEC5CE" fill-rule="nonzero" points="354 35 -2.84217094e-14 35 -2.84217094e-14 34 354 34"></polygon>
                </g>
                <g id="Group-3" stroke-width="1" transform="translate(26.000000, 0.000000)">
                    <g id="Rectangle-4">
                        <use fill="#E1F2FB" fill-rule="evenodd" xlink:href="#path-92"></use>
                        <rect stroke="#CAD1DD" stroke-width="1" x="0.5" y="0.5" width="17" height="46"></rect>
                    </g>
                    <g id="Rectangle-4">
                        <use fill="#E1F2FB" fill-rule="evenodd" xlink:href="#path-93"></use>
                        <rect stroke="#CAD1DD" stroke-width="1" x="17.5" y="0.5" width="17" height="46"></rect>
                    </g>
                    <g id="Rectangle-4">
                        <use fill="#E1F2FB" fill-rule="evenodd" xlink:href="#path-94"></use>
                        <rect stroke="#CAD1DD" stroke-width="1" x="51.5" y="0.5" width="17" height="46"></rect>
                    </g>
                    <g id="Rectangle-4">
                        <use fill="#E1F2FB" fill-rule="evenodd" xlink:href="#path-95"></use>
                        <rect stroke="#CAD1DD" stroke-width="1" x="34.5" y="0.5" width="17" height="46"></rect>
                    </g>
                    <g id="Rectangle-4">
                        <use fill="#E1F2FB" fill-rule="evenodd" xlink:href="#path-96"></use>
                        <rect stroke="#CAD1DD" stroke-width="1" x="68.5" y="0.5" width="17" height="46"></rect>
                    </g>
                </g>
                <g id="Group-3-Copy-2" stroke-width="1" transform="translate(154.000000, 0.000000)">
                    <g id="Rectangle-4">
                        <use fill="#E1F2FB" fill-rule="evenodd" xlink:href="#path-97"></use>
                        <rect stroke="#CAD1DD" stroke-width="1" x="0.5" y="0.5" width="17" height="46"></rect>
                    </g>
                    <g id="Rectangle-4">
                        <use fill="#E1F2FB" fill-rule="evenodd" xlink:href="#path-98"></use>
                        <rect stroke="#CAD1DD" stroke-width="1" x="34.5" y="0.5" width="17" height="46"></rect>
                    </g>
                    <g id="Rectangle-4">
                        <use fill="#E1F2FB" fill-rule="evenodd" xlink:href="#path-99"></use>
                        <rect stroke="#CAD1DD" stroke-width="1" x="17.5" y="0.5" width="17" height="46"></rect>
                    </g>
                </g>
                <g id="Group-3-Copy" stroke-width="1" transform="translate(248.000000, 0.000000)">
                    <g id="Rectangle-4">
                        <use fill="#E1F2FB" fill-rule="evenodd" xlink:href="#path-100"></use>
                        <rect stroke="#CAD1DD" stroke-width="1" x="0.5" y="0.5" width="17" height="46"></rect>
                    </g>
                    <g id="Rectangle-4">
                        <use fill="#E1F2FB" fill-rule="evenodd" xlink:href="#path-101"></use>
                        <rect stroke="#CAD1DD" stroke-width="1" x="17.5" y="0.5" width="17" height="46"></rect>
                    </g>
                    <g id="Rectangle-4">
                        <use fill="#E1F2FB" fill-rule="evenodd" xlink:href="#path-102"></use>
                        <rect stroke="#CAD1DD" stroke-width="1" x="51.5" y="0.5" width="17" height="46"></rect>
                    </g>
                    <g id="Rectangle-4">
                        <use fill="#E1F2FB" fill-rule="evenodd" xlink:href="#path-103"></use>
                        <rect stroke="#CAD1DD" stroke-width="1" x="34.5" y="0.5" width="17" height="46"></rect>
                    </g>
                    <g id="Rectangle-4">
                        <use fill="#E1F2FB" fill-rule="evenodd" xlink:href="#path-104"></use>
                        <rect stroke="#CAD1DD" stroke-width="1" x="68.5" y="0.5" width="17" height="46"></rect>
                    </g>
                </g>
                <g id="Group-4" stroke-width="1" transform="translate(2.000000, 47.000000)">
                    <polygon id="Line-2-Copy-3" fill="#F0F2F7" fill-rule="nonzero" points="356 1 0 1 0 0 356 0"></polygon>
                    <polygon id="Line-2-Copy-4" fill="#CAD1DD" fill-rule="nonzero" points="355 2 1 2 1 1 355 1"></polygon>
                    <polygon id="Line-2-Copy-5" fill="#F0F2F7" fill-rule="nonzero" points="356 3 0 3 0 2 356 2"></polygon>
                    <polygon id="Line-2-Copy-7" fill="#F0F2F7" fill-rule="nonzero" points="356 5 0 5 0 4 356 4"></polygon>
                    <polygon id="Line-2-Copy-6" fill="#CAD1DD" fill-rule="nonzero" points="355 4 1 4 1 3 355 3"></polygon>
                </g>
                <rect id="Rectangle-13" fill-opacity="0.06" fill="#000000" x="3" y="0" width="354" height="5"></rect>
            </g>
            <rect id="Bg" fill="#FCFBF3" x="11" y="127" width="354" height="9"></rect>
            <rect id="Bg" fill-opacity="0.06" fill="#000000" x="11" y="127" width="354" height="2"></rect>
            <g id="Group-4" transform="translate(10.000000, 122.000000)" fill-rule="nonzero">
                <polygon id="Line-2-Copy-3" fill="#F0F2F7" points="356 1 0 1 0 0 356 0"></polygon>
                <polygon id="Line-2-Copy-4" fill="#CAD1DD" points="355 2 1 2 1 1 355 1"></polygon>
                <polygon id="Line-2-Copy-5" fill="#F0F2F7" points="356 3 0 3 0 2 356 2"></polygon>
                <polygon id="Line-2-Copy-7" fill="#F0F2F7" points="356 5 0 5 0 4 356 4"></polygon>
                <polygon id="Line-2-Copy-6" fill="#CAD1DD" points="355 4 1 4 1 3 355 3"></polygon>
            </g>
        </g>
    </g>
</svg>