<?xml version="1.0" encoding="UTF-8" standalone="no"?>
<svg width="33px" height="61px" viewBox="0 0 33 61" version="1.1" xmlns="http://www.w3.org/2000/svg" xmlns:xlink="http://www.w3.org/1999/xlink">
    <!-- Generator: Sketch 49.3 (51167) - http://www.bohemiancoding.com/sketch -->
    <title>2</title>
    <desc>Created with Sketch.</desc>
    <defs></defs>
    <g id="高雄左營店" stroke="none" stroke-width="1" fill="none" fill-rule="evenodd">
        <g id="two" transform="translate(0.000000, -627.000000)">
            <g id="2F" transform="translate(5.000000, 627.000000)">
                <rect id="Bg" fill="#E2E6EE" x="3" y="0" width="359" height="58"></rect>
                <g id="lines" transform="translate(3.000000, 0.000000)" fill="#CAD1DD" fill-rule="nonzero">
                    <polygon id="Line-Copy" points="10 0 10 58 9 58 9 0"></polygon>
                    <polygon id="Line-Copy" points="20 0 20 58 19 58 19 0"></polygon>
                    <polygon id="Line-2" points="359 29 -2.84217094e-14 29 -2.84217094e-14 28 359 28"></polygon>
                    <polygon id="Line-2" points="359 19 -2.84217094e-14 19 -2.84217094e-14 18 359 18"></polygon>
                    <polygon id="Line-2" points="359 9 -2.84217094e-14 9 -2.84217094e-14 8 359 8"></polygon>
                    <polygon id="Line-2-Copy" points="359 39 -2.84217094e-14 39 -2.84217094e-14 38 359 38"></polygon>
                    <polygon id="Line-2-Copy-3" points="359 49 -2.84217094e-14 49 -2.84217094e-14 48 359 48"></polygon>
                </g>
                <rect id="Bg" fill="#F0F2F7" x="0" y="58" width="365" height="3"></rect>
            </g>
        </g>
    </g>
</svg>