<svg xmlns="http://www.w3.org/2000/svg" width="26" height="44" viewBox="0 0 26 44">
    <g fill="none" fill-rule="evenodd">
        <ellipse cx="13" cy="40" fill="#9DA6B9" rx="11" ry="4"/>
        <path fill="#DE0716" d="M0 12.6C0 5.634 5.813 0 13 0s13 5.634 13 12.6C26 22.05 13 36 13 36S0 22.05 0 12.6zM13 18c2.76 0 5-2.24 5-5s-2.24-5-5-5-5 2.24-5 5 2.24 5 5 5z"/>
    </g>
</svg>
