{

  "app_debug": true,

  "run_host": "0.0.0.0",
  "run_port": 8792,
  "app_host": "0.0.0.0",
  "app_port": 8792,
  "main_name": "review_moderating",
  "main_loglevel": "INFO",
  "main_enable_access_log": false,
  "main_env": "dev",

  "etc_sentry_enabled": false,
  "etc_sentry_dsn": "",
  "etc_sentry_sample_rate": 1.0,
  "etc_sentry_traces_sample_rate": 0.01,
  "etc_system_locale": "ru_RU",
  "etc_routes_rpc": "/public/rpc",

  "services_db_init_db": true,
  "services_db_host": "0.0.0.0",
  "services_db_port": 5432,
  "services_db_database": "review_core",
  "services_db_root_user": "postgres",
  "services_db_root_password": "postgres",
  "services_db_user": "elemento",
  "services_db_password": "elemento",
  "services_db_poll_min_size": 4,
  "services_db_poll_max_size": 16,

  "jwt_access_token_ttl": 20000,
  "jwt_refresh_token_ttl": 80000,
  "default_request_time": 500,
  "services_redis_host": "0.0.0.0",
  "services_redis_port": 6379,
  "services_redis_password": null,
  "services_redis_db": 0,
 "services_review_host": "http://0.0.0.0:8791",
  "services_rpc_system_permission_key": "guest",
  "services_rpc_guest_permission_key": "guest",

  "streams_group_id": "review_moderating",
  "streams_redis_enabled": true,
  "streams_topic": ["review_moderating"],
  "streams_record_trim_size": 100000,
  "streams_max_records": 100000,
  "base_stream_topic": "review_moderating",
  "services_indices_reload_scripts": false,
  "streams_bootstrap_servers": ["localhost"],
  "streams_kafka_bootstrap_servers": ["localhost"]
}
