Name,Sex,Equipment,BodyweightKg,WeightClassKg,Division,Squat1Kg,Squat2Kg,Squat3Kg,Best3SquatKg,Bench1Kg,Bench2Kg,Bench3Kg,Best3BenchKg,Deadlift1Kg,Deadlift2Kg,Deadlift3Kg,Best3DeadliftKg,TotalKg,Event,Place,AgeClass
Victoria Eldridge,F,Raw,87.9,84+,F-C-G,85,90,95,95,42.5,45,47.5,47.5,90,95,100,100,242.5,SBD,G,23.5-38.5
Tess O'Flaherty,F,Raw,55.7,57,F-C-M1,60,70,75,75,42.5,47.5,-52.5,47.5,80,90,95,95,217.5,SBD,2,39.5-48.5
Liz Sewell,F,Raw,56.9,57,F-C-M1,85,87.5,92.5,92.5,42.5,45,50,50,107.5,112.5,120,120,262.5,SBD,1,39.5-48.5
Helena Gregory,F,Raw,55,57,F-C-Open,60,70,-80,70,40,45,47.5,47.5,95,110,120,120,237.5,SBD,1,0-22.5
Chantel Peers,F,Raw,58.7,63,F-C-Open,70,75,80,80,45,50,-55,50,90,105,115,115,245,SBD,2,23.5-38.5
Sian Kenny,F,Raw,58.4,63,F-C-Open,70,80,-85,80,40,42.5,45,45,90,95,100,100,225,SBD,3,23.5-38.5
Carmen Jones,F,Raw,61.4,63,F-C-Open,95,105,110,110,40,45,47.5,47.5,120,132.5,140,140,297.5,SBD,1,23.5-38.5
Amy McDermott,F,Raw,71.5,72,F-C-Open,65,77.5,85,85,50,57.5,-60,57.5,110,120,-130,120,262.5,SBD,1,0-22.5
Andrea Wilkinson,F,Raw,65.1,72,F-C-M2,55,65,75,75,40,45,55,55,80,100,117.5,117.5,247.5,SBD,1,49.5-58.5
Claud Cunningham,F,Raw,83,84,F-C-M1,95,100,102.5,102.5,42.5,47.5,52.5,52.5,85,92.5,100,100,255,SBD,1,39.5-48.5
Adele Fothersgill,F,Raw,84.6,84+,F-C-M1,70,80,85,85,40,47.5,52.5,52.5,80,100,112.5,112.5,250,SBD,2,39.5-48.5
Jo Whiteley,F,Raw,104.2,84+,F-C-M1,115,125,130,130,67.5,72.5,-75.5,72.5,152.5,162.5,-170,162.5,365,SBD,1,39.5-48.5
Helen Toms,F,Raw,88.9,84+,F-C-G,117.5,120,122.5,122.5,52.5,57.5,62.5,62.5,125,132.5,145,145,330,SBD,G,49.5-58.5
Ian Shaw,M,Raw,91.7,93,M-C-M1,200,210,,210,120,127.5,,127.5,250,262.5,,262.5,600,SBD,1,39.5-48.5
Ted Moore,M,Raw,103.8,105,M-C-M3,170,190,,190,120,-132.5,-132.5,120,220,235,-250,235,545,SBD,1,59.5-68.5
David Charnock,M,Raw,116.7,120,M-C-M2,175,200,220,220,120,135,-140,135,210,240,255,255,610,SBD,1,49.5-58.5
Frazer Pennington,M,Raw,120.7,120+,M-C-G,245,260,270,270,140,147.5,-155,147.5,235,247.5,255,255,672.5,SBD,G,0-22.5
Danny Smith,M,Raw,65,66,M-C-Open,135,140,-145,140,90,-95,-95,90,165,175,180,180,410,SBD,1,23.5-38.5
Gary Lee,M,Raw,65,66,M-C-Open,160,-165,-165,160,-90,90,95,95,-200,-200,,,,SBD,DQ,23.5-38.5
Josh Wahlers,M,Raw,72.4,74,M-C-Open,145,155,165,165,90,95,100,100,180,192.5,205,205,470,SBD,1,0-22.5
Simon Barrington,M,Raw,70.2,74,M-C-Open,110,,,110,140,-150,-150,140,180,-190,-190,180,430,SBD,2,23.5-38.5
Martin Liu,M,Raw,73.7,74,M-C-Open,110,115,-120,115,95,-100,-100,95,120,130,142.5,142.5,352.5,SBD,3,23.5-38.5
Kalvin Hughes,M,Raw,82.1,83,M-C-Open,200,210,215,215,135,145,150,150,210,220,230,230,595,SBD,1,0-22.5
Clark Thompson,M,Raw,82.5,83,M-C-Open,180,190,200,200,107.5,115,-120,115,215,230,-240,230,545,SBD,2,23.5-38.5
Stuart Nicholson,M,Raw,79,83,M-C-Open,135,145,152.5,152.5,110,120,-125,120,180,195,210,210,482.5,SBD,3,23.5-38.5
Ashley Saddoo,M,Raw,78.3,83,M-C-Open,142.5,152.5,162.5,162.5,82.5,90,-95,90,185,205,217.5,217.5,470,SBD,4,0-22.5
Edward Anson,M,Raw,78.8,83,M-C-Open,150,160,170,170,90,95,-100,95,160,170,180,180,445,SBD,5,0-22.5
Dave Graham,M,Raw,76.1,83,M-C-Open,-140,-140,140,140,97.5,102.5,107.5,107.5,160,170,180,180,427.5,SBD,6,23.5-38.5
Kevin Lloyd,M,Raw,80.9,83,M-C-Open,160,175,-182.5,175,-125,-135,-135,,180,200,210,210,,SBD,DQ,23.5-38.5
Connor Lannon,M,Raw,82.2,83,M-C-Open,180,190,-195,190,,-120,-120,,200,210,220,220,,SBD,DQ,0-22.5
John McBride,M,Raw,88.3,93,M-C-Open,222.5,232.5,240,240,140,147.5,155,155,242.5,255,-265,255,650,SBD,1,23.5-38.5
Connor Challinor,M,Raw,91.6,93,M-C-Open,200,210,217.5,217.5,130,-140,-140,130,245,255,-265,255,602.5,SBD,2,0-22.5
Tom Yarrow,M,Raw,90.2,93,M-C-Open,195,205,210,210,100,110,115,115,230,245,250,250,575,SBD,3,23.5-38.5
Clayton Leah,M,Raw,90.4,93,M-C-Open,190,192.5,210,210,100,-110,,100,220,-240,-240,220,530,SBD,4,0-22.5
Jean-Paul Hitchmough,M,Raw,87.7,93,M-C-Open,160,-180,-180,160,-100,100,-110,100,160,165,170,170,430,SBD,5,0-22.5
Martyn Wood,M,Raw,85.1,93,M-C-Open,132.5,150,165,165,-82.5,90,95,95,135,150,162.5,162.5,422.5,SBD,6,23.5-38.5
Luke Whitehead,M,Raw,89.2,93,M-C-Open,105,110,112.5,112.5,67.5,72.5,77.5,77.5,145,150,157.5,157.5,347.5,SBD,7,0-17.5
Alexander Halliwell,M,Raw,103.1,105,M-C-Open,200,210,-220,210,120,127.5,-135,127.5,230,245,250,250,587.5,SBD,1,0-22.5
Paul Blain,M,Raw,98.3,105,M-C-Open,185,200,-205,200,130,140,-145,140,230,235,245,245,585,SBD,2,23.5-38.5
Ryan Dean,M,Raw,103.6,105,M-C-Open,195,205,-210,205,145,-155,-155,145,210,220,230,230,580,SBD,3,0-22.5
Keenan Shannon,M,Raw,102.2,105,M-C-Open,185,200,205,205,115,120,-125,120,225,235,-242.5,235,560,SBD,4,0-22.5
Mike Williams,M,Raw,104.3,105,M-C-Open,150,-170,-170,150,135,142.5,147.5,147.5,200,220,240,240,537.5,SBD,5,23.5-38.5
Ian Lee,M,Raw,96.4,105,M-C-Open,172.5,180,197.5,197.5,95,102.5,107.5,107.5,202.5,215,227.5,227.5,532.5,SBD,6,23.5-38.5
Sean Broley,M,Raw,101.5,105,M-C-Open,162.5,177.5,-185,177.5,110,117.5,-125,117.5,200,217.5,227.5,227.5,522.5,SBD,7,0-22.5
Max Roberts,M,Raw,99.9,105,M-C-Open,160,170,180,180,-110,110,120,120,170,190,210,210,510,SBD,8,23.5-38.5
Phil Booth,M,Raw,95.8,105,M-C-Open,140,-160,-170,140,90,100,105,105,160,180,-200,180,425,SBD,9,23.5-38.5
Glen McGlasson,M,Raw,96.8,105,M-C-Open,130,140,150,150,85,-90,-90,85,170,180,-190,180,415,SBD,10,39.5-48.5
Gary Fletcher,M,Raw,104.2,105,M-C-Open,100,117.5,-132.5,117.5,85,92.5,-97.5,92.5,125,140,155,155,365,SBD,11,23.5-38.5
Tom Smith,M,Raw,112.9,120,M-C-Open,185,-195,195,195,125,130,132.5,132.5,250,262.5,272.5,272.5,600,SBD,1,0-22.5
Paul Hendrickse,M,Raw,113,120,M-C-Open,-170,-170,170,170,130,-140,145,145,190,205,220,220,535,SBD,2,23.5-38.5
Jordon Siddall,M,Raw,110.4,120,M-C-Open,150,160,167.5,167.5,130,137.5,-145,137.5,205,220,-230,220,525,SBD,3,0-22.5
Matt Ashworth,M,Raw,105.3,120,M-C-Open,150,170,190,190,90,100,-105,100,180,210,-235,210,500,SBD,4,23.5-38.5
Will Freeman Dunn,M,Raw,109.5,120,M-C-Open,140,155,170,170,130,140,150,150,150,170,180,180,500,SBD,5,23.5-38.5
Paul Williamson,M,Raw,144,120+,M-C-Open,180,200,210,210,100,-110,-110,100,200,220,,220,530,SBD,6,23.5-38.5
Richard Bruce,M,Raw,71.4,74,M-C-G,,,,,125,152.5,155,155,,,,,155,B,G,23.5-38.5
Robert Rodney,M,Raw,90.8,93,M-C-G,175,200,220,220,130,140,150,150,180,210,240,240,610,SBD,G,49.5-58.5
David Carter,M,Raw,92.9,93,M-C-G,185,200,207.5,207.5,130,135,140,140,220,252.5,272.5,272.5,620,SBD,G,49.5-58.5
Charlie Bloxham,M,Single-ply,100.3,105,M-E-Open,215,222.5,-230,222.5,-137.5,-137.5,137.5,137.5,210,217.5,225,225,585,SBD,1,23.5-38.5
