Place,Name,State,WeightClassKg,BodyweightKg,Age,Best3SquatKg,Best3BenchKg,Best3DeadliftKg,TotalKg,Sex,Division,Equipment,Event
1,Kristin Bergeron,LA,52,51,21,60,27.5,95,182.5,F,Juniors 20-23,Raw,SBD
1,Sarah Parsons,LA,67.5,63.2,22,87.5,40,102.5,230,F,Juniors 20-23,Raw,SBD
1,Abbie Seek,TX,75,70.3,17,120,65,140,325,F,Juniors 16-17,Raw,SBD
1,Karina Gonzalez,TX,82.5,79.5,19,147.5,67.5,187.5,402.5,F,Juniors 18-19,Raw,SBD
1,Rachel Villarreal,TX,90+,111.3,21,112.5,67.5,145,325,F,Juniors 20-23,Raw,SBD
1,Lauren Walls,TX,56,54.9,30,97.5,60,105,262.5,F,Open,Raw,SBD
1,Nicole Gonzalez,TX,60,59.9,33,192.5,100,215,507.5,F,Open,Raw,SBD
2,Krystle Conner,TX,60,58.9,28,125,87.5,155,367.5,F,Open,Raw,SBD
3,Natalie Hegg,TX,60,58.6,32,97.5,62.5,127.5,287.5,F,Open,Raw,SBD
4,Ashley Molina,TX,60,60,33,87.5,42.5,110,240,F,Open,Raw,SBD
1,Brittany Witt,TX,67.5,63.2,28,115,62.5,137.5,315,F,Open,Raw,SBD
2,Elba Rojas,TX,67.5,64.7,35,65,37.5,97.5,200,F,Open,Raw,SBD
1,Jacklyn Jackson,TX,75,74.9,25,130,65,172.5,367.5,F,Open,Raw,SBD
2,Rachel Cutts,CA,75,74.8,28,115,75,160,350,F,Open,Raw,SBD
3,Karina Guajardo,TX,75,70.5,28,92.5,57.5,112.5,262.5,F,Open,Raw,SBD
1,Abbe Ball,TX,82.5,77.6,33,125,55,147.5,327.5,F,Open,Raw,SBD
1,Jennifer Martin-Logan,TX,67.5,62.5,46,67.5,40,87.5,195,F,Masters 45-49,Raw,SBD
1,Scharlotte Spencer,TX,82.5,80.7,41,100,57.5,172.5,330,F,Masters 40-44,Raw,SBD
1,Griffin Gillespie,TX,75,73.9,18,165,102.5,192.5,460,M,Juniors 18-19,Raw,SBD
1,Kenneth Miller,TX,75,73.4,20,197.5,127.5,192.5,517.5,M,Juniors 20-23,Raw,SBD
1,Kaleb Hairston,TX,82.5,79.1,18,237.5,145.5,252.5,635.5,M,Juniors 18-19,Raw,SBD
2,Enrique Barron,TX,82.5,81.1,18,200,112.5,240,552.5,M,Juniors 18-19,Raw,SBD
1,Michael LaTurner,LA,90,84.1,22,190,112.5,215,517.5,M,Juniors 20-23,Raw,SBD
1,Taylor Hull,TX,100,97,19,250,145,250,645,M,Juniors 18-19,Raw,SBD
2,Thomas Adams #2,LA,100,92.7,18,170,127.5,205,502.5,M,Juniors 18-19,Raw,SBD
1,Matthew Scott-Budd,LA,110,108.5,21,220,157.5,247.5,625,M,Juniors 20-23,Raw,SBD
DQ,Robert Gurrath,WI,110,107.7,22,262.5,,,,M,Juniors 20-23,Raw,SBD
1,Josh Opiela,TX,125,124.1,20,300,190,250,740,M,Juniors 20-23,Raw,SBD
1,Jose Armas,TX,140+,140.5,19,237.5,215,230,682.5,M,Juniors 18-19,Raw,SBD
1,Seth Daigre,TX,56,55.5,26,132.5,90,190,412.5,M,Open,Raw,SBD
1,Adam McMullen,TX,82.5,80.5,32,222.5,140,275,637.5,M,Open,Raw,SBD
2,Dex Nepomuceno,LA,82.5,81.7,26,227.5,152.5,252.5,632.5,M,Open,Raw,SBD
3,Jesse McDaniel,TX,82.5,82.1,37,170,140,215,525,M,Open,Raw,SBD
4,Casey Allison,TX,82.5,77.4,30,170,132.5,200,502.5,M,Open,Raw,SBD
5,Michael Anton,TX,82.5,80.2,28,165,135,200,500,M,Open,Raw,SBD
1,Jeff Mestayer,TX,90,87.8,36,245,187.5,237.5,670,M,Open,Raw,SBD
2,Chase Morgan,TX,90,86.5,27,187.5,132.5,227.5,547.5,M,Open,Raw,SBD
3,Ryan Ball,TX,90,87.8,33,172.5,130,217.5,520,M,Open,Raw,SBD
1,Anthony Rodriguez,TX,100,97.9,34,232.5,150,342.5,725,M,Open,Raw,SBD
2,Marshall Harmon,LA,100,99.3,22,252.5,182.5,272.5,707.5,M,Open,Raw,SBD
3,Clayton West,TX,100,98.6,30,227.5,187.5,272.5,687.5,M,Open,Raw,SBD
4,Taylor Hull,TX,100,97,19,250,145,250,645,M,Open,Raw,SBD
5,Jon Johnson,TX,100,94.4,27,192.5,132.5,207.5,532.5,M,Open,Raw,SBD
6,Morgan Johnson,LA,100,98.1,29,182.5,120,227.5,530,M,Open,Raw,SBD
1,Robert Baker,TX,110,108,30,260,175,300,735,M,Open,Raw,SBD
2,Evan Hardy,LA,110,101.6,27,227.5,157.5,282.5,667.5,M,Open,Raw,SBD
3,Jared Sporrer,TX,110,106.9,31,232.5,152.5,272.5,657.5,M,Open,Raw,SBD
4,Sam Bryan,TX,110,108.4,31,185,105,200,490,M,Open,Raw,SBD
1,Josh Opiela,TX,125,124.1,20,300,190,250,740,M,Open,Raw,SBD
2,John Head,LA,125,121.7,24,257.5,137.5,267.5,662.5,M,Open,Raw,SBD
1,Jeff Younker,TX,140,137.5,30,330,240,347.5,917.5,M,Open,Raw,SBD
2,Byron Biagas,LA,140,139.5,34,242.5,217.5,260,720,M,Open,Raw,SBD
3,Joaquin Vargas,TX,140,126.8,27,195,110,185,490,M,Open,Raw,SBD
DQ,Nathan White,OK,140,133.6,42,187.5,,,,M,Open,Raw,SBD
1,Jesse McDaniel,TX,82.5,82.1,37,170,140,215,525,M,Submasters 35-39,Raw,SBD
1,Jeff Mestayer,TX,90,87.8,36,245,187.5,237.5,670,M,Submasters 35-39,Raw,SBD
1,Dwight Seek,TX,100,97,52,140,110,197.5,447.5,M,Masters 50-54,Raw,SBD
DQ,Nathan White,OK,140,133.6,42,187.5,,,,M,Masters 40-44,Raw,SBD
1,Calie Chesler,TX,60,60,19,125,60,137.5,322.5,F,Juniors 18-19,Wraps,SBD
1,Amanda Wolff,TX,75,72.5,27,160,102.5,200,462.5,F,Open,Wraps,SBD
DQ,Kathryn Wyman,TX,82.5,75.4,54,,37.5,102.5,,F,Masters 50-54,Wraps,SBD
1,Chaise Juarez,TX,75,72.9,16,122.5,87.5,145,355,M,Juniors 16-17,Wraps,SBD
1,Hunter Belesky,TX,140+,177.5,17,230,107.5,195,532.5,M,Juniors 16-17,Wraps,SBD
1,Joshua Villarreal,TX,90,88,24,232.5,165,227.5,625,M,Open,Wraps,SBD
1,Justin Sandoval,TX,100,98.8,25,202.5,142.5,245,590,M,Open,Wraps,SBD
1,Adam Hughes,LA,110,104,28,312.5,190,295,797.5,M,Open,Wraps,SBD
1,Michael Rizo,MI,140+,147.5,27,265,192.5,272.5,730,M,Open,Wraps,SBD
1,Kiara McDonald,TX,75,70.5,17,115,70,115,300,F,Juniors 16-17,Single-ply,SBD
1,Tamara McElwee,AR,60,58,49,145,82.5,152.5,380,F,Masters 45-49,Single-ply,SBD
1,Hunter Work,TX,75,74.3,22,242.5,185,222.5,650,M,Juniors 20-23,Single-ply,SBD
1,Hunter Work,TX,75,74.3,22,242.5,185,222.5,650,M,Open,Single-ply,SBD
1,Marks Labostrie,TX,90,88.7,30,200,125,277.5,602.5,M,Open,Single-ply,SBD
1,Joe Wronkowski,LA,110,103.5,51,255,160,260,675,M,Masters 50-54,Single-ply,SBD
DQ,Phillip Mardis,LA,125,123,29,330,,,,M,Open,Multi-ply,SBD
1,Syrenthia Jasper,TX,75,72.5,46,,65,,65,F,Masters 45-49,Raw,B
1,Zack Ruhl,TX,75,70,28,,217.5,,217.5,M,Open,Raw,B
1,Jake Gieselman,TX,82.5,82,25,,157.5,,157.5,M,Open,Raw,B
2,Collin Smith,TX,82.5,80.1,28,,130,,130,M,Open,Raw,B
1,Kenderick Webb,TX,90,88.5,32,,190,,190,M,Open,Raw,B
1,VH Shelton,TX,100,96.1,39,,162.5,,162.5,M,Open,Raw,B
1,James Strickland,TX,125,124.5,36,,275,,275,M,Open,Raw,B
2,Jacob Bell,TX,125,116.4,37,,220,,220,M,Open,Raw,B
3,Eric LaBarge,TX,125,113.7,40,,192.5,,192.5,M,Open,Raw,B
1,VH Shelton,TX,100,96.1,39,,162.5,,162.5,M,Submasters 35-39,Raw,B
1,Jacob Bell,TX,125,116.4,37,,220,,220,M,Submasters 35-39,Raw,B
1,Joseph Chapman,TX,110,103.5,60,,105,,105,M,Masters 60-64,Raw,B
1,Eric LaBarge,TX,125,113.7,40,,192.5,,192.5,M,Masters 40-44,Raw,B
DQ,Wayne Sonnier,TX,125,120,59,,,,,M,Open,Single-ply,B
DQ,Wayne Sonnier,TX,125,120,59,,,,,M,Masters 55-59,Single-ply,B
DQ,Robert Gurrath,WI,110,107.7,22,,,,,M,Juniors 20-23,Raw,D
1,Tom Emelander,TX,125,124.1,34,,,365,365,M,Open,Raw,D
1,Jeff Younker,TX,140,137.5,30,,,347.5,347.5,M,Open,Raw,D
DQ,Nathan White,OK,140,133.6,42,,,,,M,Masters 40-44,Raw,D
1,Kathryn Wyman,TX,82.5,75.4,54,,37.5,102.5,140,F,Masters 50-54,Raw,BD
1,Eston Epton,TX,82.5,81.7,17,,115,182.5,297.5,M,Juniors 16-17,Raw,BD
