Place,Name,State,WeightClassKg,BodyweightKg,Age,Best3SquatKg,Best3BenchKg,Best3DeadliftKg,TotalKg,Sex,Division,Equipment,Squat4Kg,Bench4Kg,Event
1,Madison Avendano,TX,48,43.5,14,42.5,30,42.5,115,F,Juniors 13-15,Raw,,,SBD
1,Michelle Do,TX,60,59.8,23,100,60,102.5,262.5,F,Juniors 20-23,Raw,,,SBD
1,Cristal Prato,TX,67.5,65.9,23,82.5,42.5,100,225,F,Juniors 20-23,Raw,,,SBD
1,Annie Diu,TX,52,49.3,24,122.5,67.5,150,340,F,Open,Raw,,,SBD
2,Phoebe Morlales,TX,52,50.7,24,120,45,132.5,297.5,F,Open,Raw,,,SBD
1,Denise Marquez,TX,56,55.4,23,100,57.5,145,302.5,F,Open,Raw,,,SBD
2,Hannah McCreight,TX,56,55.3,24,67.5,42.5,92.5,202.5,F,Open,Raw,,,SBD
1,Dominique Trimino,TX,60,59.8,31,97.5,55,102.5,255,F,Open,Raw,,,SBD
2,Shelby Nivitanont,TX,60,57.7,24,90,42.5,85,217.5,F,Open,Raw,,,SBD
1,Darla King,TX,67.5,67.4,40,127.5,77.5,145,350,F,Open,Raw,,,SBD
2,Madeline McClure,TX,67.5,64.6,26,110,70,157.5,337.5,F,Open,Raw,,,SBD
3,Amanda Parson,TX,67.5,67.1,30,125,57.5,145,327.5,F,Open,Raw,,,SBD
4,Heather Griffiths,TX,67.5,65.4,25,107.5,62.5,142.5,312.5,F,Open,Raw,,,SBD
5,Anna D'Alessio,TX,67.5,61.6,25,115,67.5,127.5,310,F,Open,Raw,,,SBD
DQ,Allyson Cobb,TX,67.5,66.7,24,90,-47.5,,,F,Open,Raw,130,,SBD
1,Kim Burke,TX,75,74.3,46,125,80,155,360,F,Open,Raw,,,SBD
2,Amanda Bracwell,TX,75,74.2,30,107.5,70,135,312.5,F,Open,Raw,,,SBD
3,Laura Rumpf,TX,75,71.7,39,110,60,125,295,F,Open,Raw,,,SBD
4,Ashley Robinson,TX,75,69.5,25,110,47.5,110,267.5,F,Open,Raw,,,SBD
5,Trisha Fudge,CA,75,71,25,80,52.5,112.5,245,F,Open,Raw,,,SBD
1,Jessica De Hoyos,TX,90,89,31,127.5,87.5,157.5,372.5,F,Open,Raw,,,SBD
2,Clarissa Archer,TX,90,89.4,25,115,60,120,295,F,Open,Raw,,,SBD
1,Rebecca Foster,TX,90+,99.9,37,147.5,82.5,185,415,F,Open,Raw,,,SBD
2,Robin Aoki,TX,90+,107.9,29,105,65,145,315,F,Open,Raw,,,SBD
DQ,Rita Avendoano,TX,52,51.9,36,-82.5,,,,F,Submasters 35-39,Raw,,,SBD
1,Jennifer Nelson,TX,67.5,66.9,37,75,37.5,92.5,205,F,Submasters 35-39,Raw,,,SBD
1,Rebecca Foster,TX,90+,99.9,37,147.5,82.5,185,415,F,Submasters 35-39,Raw,,,SBD
1,Marry Su,TX,56,52.4,45,80,45,107.5,232.5,F,Masters 45-49,Raw,,,SBD
1,Darla King,TX,67.5,67.4,40,127.5,77.5,145,350,F,Masters 40-44,Raw,,,SBD
1,Kim Burke,TX,75,74.3,46,125,80,155,360,F,Masters 45-49,Raw,130,,SBD
1,Nelda Newton,NC,75,68.3,53,82.5,52.5,122.5,257.5,F,Masters 50-54,Raw,,,SBD
1,Andrea Wells,TX,75,74,40,112.5,75,132.5,320,F,Masters 40-44,Raw,,,SBD
1,Tina Collins,TX,82.5,80.2,46,120,72.5,145,337.5,F,Masters 45-49,Raw,,75,SBD
1,Tyra Humphries,TX,90+,116.1,40,120,72.5,122.5,315,F,Masters 40-44,Raw,,,SBD
1,Damian Schultz,TX,75,74.6,19,195,115,240,550,M,Juniors 18-19,Raw,,,SBD
1,David Ruiz,TX,75,74.8,23,172.5,102.5,187.5,462.5,M,Juniors 20-23,Raw,,,SBD
1,Jahaziel Ortega,TX,82.5,76,22,167.5,100,197.5,465,M,Juniors 20-23,Raw,,,SBD
1,Chase Unbehagen,TX,100,97.4,20,227.5,180,252.5,660,M,Juniors 20-23,Raw,,,SBD
2,CJ McFarland,TX,100,99.2,23,192.5,170,210,572.5,M,Juniors 20-23,Raw,,,SBD
1,Jeffery Winkler,TX,67.5,67.4,31,157.5,140,185,482.5,M,Open,Raw,,,SBD
1,Damian Schultz,TX,75,74.6,19,195,115,240,550,M,Open,Raw,,,SBD
2,Derek Stanley,TX,75,74.8,27,187.5,112.5,197.5,497.5,M,Open,Raw,,,SBD
1,Ryan Long,TX,82.5,81.8,37,247.5,147.5,240,635,M,Open,Raw,,,SBD
2,Corbyn Pye,TX,82.5,79,22,210,150,272.5,632.5,M,Open,Raw,,,SBD
3,Ty Burge,TX,82.5,81.4,27,185,115,227.5,527.5,M,Open,Raw,,,SBD
4,Joe Martinez,TX,82.5,80.6,46,155,102.5,185,442.5,M,Open,Raw,,,SBD
1,Robert Mouton,TX,90,88,35,225,145,225,595,M,Open,Raw,,,SBD
2,Daniel Nieves,TX,90,88.4,25,212.5,132.5,240,585,M,Open,Raw,,,SBD
3,Jeffrey Nivitanont,OK,90,83.4,26,200,130,232.5,562.5,M,Open,Raw,,,SBD
DQ,Albert Calamars,TX,90,89.2,30,150,102.5,-205,,M,Open,Raw,,,SBD
1,Travis Cadenhead,TX,100,100,27,292.5,195,287.5,775,M,Open,Raw,,,SBD
2,Jordan Seago,LA,100,98.6,29,230,150,292.5,672.5,M,Open,Raw,,,SBD
3,Chase Unbehagen,TX,100,97.4,20,227.5,180,252.5,660,M,Open,Raw,,,SBD
4,Dion Chavez,TX,100,99.8,34,235,167.5,227.5,630,M,Open,Raw,,,SBD
5,Stephen Malcik,TX,100,99.8,35,192.5,152.5,215,560,M,Open,Raw,,,SBD
DQ,Oscar Elias,TX,100,98,25,-195,,,,M,Open,Raw,,,SBD
1,Rocky Molina II,TX,110,109,30,242.5,150,250,642.5,M,Open,Raw,,,SBD
2,Josh Ward,TX,110,108.6,25,147.5,132.5,190,470,M,Open,Raw,,,SBD
1,Ryan Bracewell,TX,125,121.4,30,262.5,192.5,330,785,M,Open,Raw,,,SBD
2,William Lindus,TX,125,117,33,125,97.5,175,397.5,M,Open,Raw,,,SBD
DQ,Eric Jonas,TX,125,112.6,31,-155,,,,M,Open,Raw,,,SBD
1,Daryle Howard,TX,140,131.8,39,250,167.5,272.5,690,M,Open,Raw,,,SBD
2,Richard Saxton,TX,140,131.6,38,235,185,235,655,M,Open,Raw,,,SBD
1,Brett Nelson,TX,82.5,80.5,39,160,110,192.5,462.5,M,Submasters 35-39,Raw,,,SBD
DQ,Lee Harris,TX,100,97.8,36,-175,,,,M,Submasters 35-39,Raw,,,SBD
1,Richard Saxton,TX,140,131.6,39,235,185,272.5,692.5,M,Submasters 35-39,Raw,,,SBD
1,Andrew Cavanagh,TX,82.5,82.2,41,182.5,117.5,240,540,M,Masters 40-44,Raw,,,SBD
2,Eric Davidson,TX,82.5,82,40,155,92.5,200,447.5,M,Masters 40-44,Raw,,,SBD
1,Joe Martinez,TX,82.5,80.6,46,155,102.5,185,442.5,M,Masters 45-49,Raw,,,SBD
1,Scott Brockelman,TX,110,107.6,56,222.5,110,235,567.5,M,Masters 55-59,Raw,,,SBD
2,David Wisdom,TX,110,108.4,56,160,157.5,190,507.5,M,Masters 55-59,Raw,,,SBD
1,Robert Schultz,TX,125,119.6,55,222.5,172.5,235,630,M,Masters 55-59,Raw,,,SBD
1,Daryle Howard,TX,140,131.8,40,250,167.5,272.5,690,M,Masters 40-44,Raw,,,SBD
1,Alle Elizondo,TX,52,52,19,100,57.5,110,267.5,F,Juniors 18-19,Wraps,105,,SBD
1,Jordan Ontiveros,TX,67.5,64.3,20,82.5,37.5,95,215,F,Juniors 20-23,Wraps,,,SBD
DQ,Christtina Guerrero,TX,75,73.8,23,-117.5,,,,F,Juniors 20-23,Wraps,,,SBD
1,Sara Mitchell,TX,82.5,77.1,15,137.5,57.5,105,300,F,Juniors 13-15,Wraps,,,SBD
1,Alle Elizondo,TX,52,52,19,100,57.5,110,267.5,F,Open,Wraps,105,,SBD
1,Elda Negrete,TX,60,59.9,35,135,72.5,125,332.5,F,Open,Wraps,,,SBD
1,Krista Kharazi,TX,67.5,67.2,26,122.5,65,152.5,340,F,Open,Wraps,,,SBD
1,Laura Facundo,TX,75,73.1,44,107.5,62.5,147.5,317.5,F,Open,Wraps,,,SBD
DQ,Stephanie Alvarez,TX,82.5,82.1,32,-175,,,,F,Open,Wraps,,,SBD
DQ,Roselyn Wilson,TX,82.5,75.5,33,-112.5,,,,F,Open,Wraps,,,SBD
1,Maria Salazar,TX,90,83,25,135,57.5,162.5,355,F,Open,Wraps,,,SBD
1,Nicole Villarreal,TX,90+,107.6,30,117.5,45,132.5,295,F,Open,Wraps,,,SBD
1,Elda Negrete,TX,60,59.9,35,135,72.5,135,342.5,F,Submasters 35-39,Wraps,,,SBD
1,Laura Facundo,TX,75,73.1,44,107.5,62.5,147.5,317.5,F,Masters 40-44,Wraps,,,SBD
1,Aliza Rivera,TX,82.5,81.2,43,92.5,50,120,262.5,F,Masters 40-44,Wraps,,,SBD
1,Paul Sanchez III,TX,100,100,16,227.5,132.5,245.5,605.5,M,Juniors 16-17,Wraps,,,SBD
1,Alfredo Delgado,TX,125,113.2,17,195,142.5,247.5,585,M,Juniors 16-17,Wraps,,,SBD
1,Josue Garzoria,TX,140,133.6,19,315,190,292.5,797.5,M,Juniors 18-19,Wraps,,,SBD
1,Cory Rebmann,TX,82.5,81.8,33,205,142.5,227.5,575,M,Open,Wraps,,,SBD
1,Mike Padilla,TX,90,88.8,46,205,147.5,227.5,580,M,Open,Wraps,,,SBD
2,Dominique Toney,TX,90,83.4,25,150,132.5,200,482.5,M,Open,Wraps,,,SBD
DQ,Brad Block,TX,90,88.6,27,177.5,-140,,,M,Open,Wraps,,,SBD
1,Rusty Coffman,TX,100,99.2,26,265,157.5,267.5,690,M,Open,Wraps,,,SBD
2,Cayman Gentry,TX,100,99.8,30,232.5,165,230,627.5,M,Open,Wraps,,,SBD
3,Paul Sanchez III,TX,100,100,16,227.5,132.5,245.5,605.5,M,Open,Wraps,,,SBD
4,Justin Parsons,TX,100,97.6,30,180,157.5,205,542.5,M,Open,Wraps,,,SBD
DQ,Geno Merriweather,TX,100,94.8,25,-250,,,,M,Open,Wraps,,,SBD
1,Ruben Rosales,TX,110,108,27,302.5,192.5,260,755,M,Open,Wraps,,,SBD
2,Carlos Cristan,TX,110,109.6,41,260,203,280,743,M,Open,Wraps,,205,SBD
3,Tommy Hastings,TX,110,109,40,252.5,157.5,282.5,692.5,M,Open,Wraps,,,SBD
4,Alex Judson,CO,110,107,25,207.5,167.5,290,665,M,Open,Wraps,,,SBD
5,Lawrence Garnett,TX,110,105.8,29,232.5,147.5,260,640,M,Open,Wraps,,,SBD
6,Jimmie Clark,TX,110,108.4,33,190,157.5,205,552.5,M,Open,Wraps,,,SBD
DQ,Javier Rosales,TX,110,105.8,24,-295,,,,M,Open,Wraps,,,SBD
1,Lee Kelly,TX,125,120.2,35,302.5,220,282.5,805,M,Open,Wraps,,,SBD
1,Eugene Fair,TX,125,120.8,35,260,195,275,730,M,Submasters 35-39,Wraps,,,SBD
1,Stephen Cole,TX,82.5,82.5,65,75,55,122.5,252.5,M,Masters 65-69,Wraps,,,SBD
1,Mike Padilla,TX,90,88.8,46,205,147.5,227.5,580,M,Masters 45-49,Wraps,,205,SBD
1,Carlos Cristan,TX,110,109.6,41,260,203,280,743,M,Masters 45-49,Wraps,,,SBD
2,Tommy Hastings,TX,110,109,40,252.5,157.5,282.5,692.5,M,Masters 45-49,Wraps,,,SBD
DQ,Quinn Jefferson,TX,125,111.6,46,247.5,-190,,,M,Masters 45-49,Wraps,,,SBD
1,Matthew Barba,TX,125,124,27,355,217.5,320,892.5,M,Open,Single-ply,,,SBD
1,Gabriel Wells,TX,125,120.6,44,282.5,245,265,792.5,M,Masters 40-44,Single-ply,,,SBD
1,Krista Kharazi-Goljahi,TX,67.5,67.2,26,,,152.5,152.5,F,Open,Raw,,,D
1,Mike Padilla,TX,90,88.8,46,,,227.5,227.5,M,Masters 45-49,Raw,,,D
