Sex,WeightClassKg,Name,AgeClass,Team,BodyweightKg,Best3SquatKg,Best3BenchKg,Best3DeadliftKg,TotalKg,Place,Division,Event,Equipment
F,82.5,Jean Maton,39.5-48.5,SM,82.4,122.5,82.5,145,350,1,F-C-M1,SBD,Raw
M,67.5,James Callender,0-19.5,SW,65.5,87.5,70,152.5,310,3,M-C-U23,SBD,Raw
M,67.5,Alex Vivian,0-19.5,SW,66.8,152.5,110.5,200,463,2,M-C-U23,SBD,Raw
M,67.5,Steven Tyers,0-22.5,SW,61.6,140,105,220,465,1,M-C-U23,SBD,Raw
M,75,Amr Taha,0-17.5,SW,70.4,100,87.5,160,347.5,1,M-C-U18,SBD,Raw
M,75,Mark Robinson,23.5-38.5,SM,74.9,167.5,102.5,210,480,1,M-C-Open,SBD,Raw
M,82.5,Thomas Hough,0-17.5,SW,77.1,130,95,190,415,1,M-C-U18,SBD,Raw
M,82.5,Gordon Kay,23.5-38.5,EM,82.1,,122.5,,122.5,1,M-C-Open,B,Raw
M,82.5,James Leaver,23.5-38.5,SW,81.6,147.5,137.5,217.5,502.5,1,M-C-Open,SBD,Raw
M,90,Nicholas Rakowski,0-19.5,SM,89,145,130,200,475,1,M-C-U23,SBD,Raw
M,90,Attif Kabir,23.5-38.5,SM,88.1,125,105,180,410,2,M-C-Open,SBD,Raw
M,90,Iain Kendrick,23.5-38.5,SM,88.8,215,140,230,585,1,M-C-Open,SBD,Raw
M,100,Grant Rickard,0-22.5,SM,98.4,190,130,200,520,1,M-C-U23,SBD,Raw
M,100,Philip Clarke,23.5-38.5,SW,95.4,160,112.5,220,492.5,1,M-C-Open,SBD,Raw
M,100,Iain Muir,23.5-38.5,SM,97.7,150,107.5,190,447.5,2,M-C-Open,SBD,Raw
M,100,Terry Jex,49.5-58.5,SM,99.9,220,150,280,650,1,M-C-M2,SBD,Raw
M,110,William Watts,23.5-38.5,SM,108.6,220,140,265,625,1,M-C-Open,SBD,Raw
M,110,David George Holloway,39.5-48.5,SM,109.2,220,135,245,600,1,M-C-M1,SBD,Raw
F,75,Lisa Hicks,0-19.5,SW,72.8,85,47.5,100,232.5,G,F-C-G,SBD,Raw
M,67.5,Alistair Cannings,0-19.5,SW,67.4,180,105,200,485,G,M-C-G,SBD,Raw
