Division,WeightClassKg,Place,Name,Team,BodyweightKg,Best3SquatKg,Best3BenchKg,Best3DeadliftKg,TotalKg,Equipment,Event,Sex
Boys,52,1,Lleyton Frazier,Tuscola Jim Ned,50.17,104.33,63.5,122.47,290.3,Single-ply,SBD,M
Boys,52,2,Jackson Heidenheimer,Anson,51.71,102.06,54.43,104.33,260.82,Single-ply,SBD,M
Boys,52,3,Isaiah Cristan,Abilene Cooper,51.17,83.91,49.9,113.4,247.21,Single-ply,SBD,M
Boys,52,4,Noah Perez,Abilene,45.45,61.23,45.36,83.91,190.51,Single-ply,SBD,M
Boys,52,DQ,Gage Rolon,Abilene Cooper,47.63,61.23,,,,Single-ply,SBD,M
Boys,52,DQ,Floyd Diamond,Tuscola Jim Ned,44.54,,,,,Single-ply,SBD,M
Boys,56,1,Gabe Boyett,Moran,55.79,145.15,81.65,145.15,371.95,Single-ply,SBD,M
Boys,56,2,Axel Marcenaro,Merkel,53.43,136.08,74.84,147.42,358.34,Single-ply,SBD,M
Boys,56,3,Brady Montgomery,Tuscola Jim Ned,54.43,131.54,68.04,127.01,326.59,Single-ply,SBD,M
Boys,56,DQ,Gilbert Borrego,Merkel,55.52,138.35,,,,Single-ply,SBD,M
Boys,60,1,Alec Arredondo,Abilene,58.15,154.22,81.65,149.69,385.55,Single-ply,SBD,M
Boys,60,2,Bryce Munoz,Anson,59.87,149.69,68.04,158.76,376.48,Single-ply,SBD,M
Boys,60,3,Fox Talamantes,Abilene,57.7,136.08,70.31,129.27,335.66,Single-ply,SBD,M
Boys,60,4,Carson Parker,Merkel,58.24,117.93,56.7,129.27,303.91,Single-ply,SBD,M
Boys,60,5,Austin Tobar,Abilene Cooper,58.24,97.52,61.23,99.79,258.55,Single-ply,SBD,M
Boys,60,DQ,Darius Monnin,Merkel,59.33,97.52,,,,Single-ply,SBD,M
Boys,67.5,1,Brock Vasquez,Hermleigh,65.32,179.17,90.72,195.04,464.93,Single-ply,SBD,M
Boys,67.5,2,Ben Lantrip,Tuscola Jim Ned,64.14,149.69,74.84,183.7,408.23,Single-ply,SBD,M
Boys,67.5,3,Michael Shubert,Abilene Cooper,66.77,136.08,77.11,176.9,390.09,Single-ply,SBD,M
Boys,67.5,4,Moses Ruzoviyo,Abilene,63.05,138.35,90.72,149.69,378.75,Single-ply,SBD,M
Boys,67.5,5,Brandon Gassiot,Tuscola Jim Ned,63.41,138.35,77.11,158.76,374.21,Single-ply,SBD,M
Boys,67.5,6,Noah Orozco,Abilene Cooper,67.13,145.15,79.38,149.69,374.21,Single-ply,SBD,M
Boys,67.5,7,Isaac Ortega,Abilene,66.22,151.95,81.65,133.81,367.41,Single-ply,SBD,M
Boys,67.5,8,Aaron Graham,Clyde,66.32,111.13,95.25,158.76,365.14,Single-ply,SBD,M
Boys,67.5,9,Randell Laird,Moran,63.05,145.15,65.77,151.95,362.87,Single-ply,SBD,M
Boys,67.5,10,Kasey Dean,Abilene,62.6,129.27,72.57,149.69,351.53,Single-ply,SBD,M
Boys,67.5,11,Korbin Rockwell,Clyde,65.05,129.27,74.84,142.88,347,Single-ply,SBD,M
Boys,67.5,12,Tyler Miller,Moran,63.5,120.2,83.91,136.08,340.19,Single-ply,SBD,M
Boys,67.5,13,Andres Salinas,Abilene,61.87,106.59,77.11,127.01,310.71,Single-ply,SBD,M
Boys,67.5,14,Ramiro Leal,Merkel,61.14,111.13,65.77,124.74,301.64,Single-ply,SBD,M
Boys,67.5,15,Slade Shipman,Merkel,66.13,104.33,70.31,120.2,294.84,Single-ply,SBD,M
Boys,67.5,DQ,Christian Alexander,Tuscola Jim Ned,65.14,174.63,,,,Single-ply,SBD,M
Boys,67.5,DQ,Tyler Razio,Tuscola Jim Ned,65.23,129.27,,,,Single-ply,SBD,M
Boys,75,1,Devin Romero,Abilene,74.84,208.65,90.72,208.65,508.02,Single-ply,SBD,M
Boys,75,2,Kaleb Moore,Clyde,74.84,190.51,124.74,172.37,487.61,Single-ply,SBD,M
Boys,75,3,Blake Proctor,Abilene,74.84,185.97,99.79,172.37,458.13,Single-ply,SBD,M
Boys,75,4,AJ Gonzales,Abilene,74.84,167.83,102.06,165.56,435.45,Single-ply,SBD,M
Boys,75,5,Gabriel Salazar,Sweetwater,74.39,149.69,92.99,188.24,430.91,Single-ply,SBD,M
Boys,75,6,Austin Eubanks,Clyde,72.21,181.44,92.99,151.95,426.38,Single-ply,SBD,M
Boys,75,7,Jacob Contreras,Tuscola Jim Ned,69.76,158.76,88.45,172.37,419.57,Single-ply,SBD,M
Boys,75,8,Rueban Perez,Abilene Cooper,73.39,156.49,92.99,165.56,415.04,Single-ply,SBD,M
Boys,75,9,Jacob Cantu,Abilene Cooper,74.84,158.76,95.25,149.69,403.7,Single-ply,SBD,M
Boys,75,10,Alex Gallegos,Sweetwater,69.04,149.69,86.18,154.22,390.09,Single-ply,SBD,M
Boys,75,11,Aaron Manke,Abilene Cooper,74.84,136.08,70.31,170.1,376.48,Single-ply,SBD,M
Boys,75,12,Zackary Yost,Clyde,72.48,142.88,83.91,142.88,369.68,Single-ply,SBD,M
Boys,75,13,Colton Brown,Anson,74.39,136.08,74.84,151.95,362.87,Single-ply,SBD,M
Boys,75,14,Casey Hall,Tuscola Jim Ned,67.77,133.81,77.11,140.61,351.53,Single-ply,SBD,M
Boys,75,15,Dillion McCoy,Tuscola Jim Ned,73.21,120.2,81.65,140.61,342.46,Single-ply,SBD,M
Boys,75,16,AJ Goodwin,Tuscola Jim Ned,74.12,115.67,70.31,113.4,299.37,Single-ply,SBD,M
Boys,75,DQ,Payton Lopez,Clyde,72.26,,,,,Single-ply,SBD,M
Boys,75,DQ,Tyler Crawford,Clyde,70.44,,,,,Single-ply,SBD,M
Boys,82.5,1,Dante Gomez,Clyde,79.15,249.48,149.69,215.46,614.62,Single-ply,SBD,M
Boys,82.5,2,Joesph Rees,Tuscola Jim Ned,80.74,192.78,102.06,233.6,528.44,Single-ply,SBD,M
Boys,82.5,3,Tate Tabor,Moran,79.38,185.97,124.74,208.65,519.36,Single-ply,SBD,M
Boys,82.5,4,Ethan Tapia,Clyde,79.02,195.04,133.81,181.44,510.29,Single-ply,SBD,M
Boys,82.5,5,Chris Jones #5,Anson,77.47,183.7,102.06,195.04,480.81,Single-ply,SBD,M
Boys,82.5,6,Jarod Pentacost,Tuscola Jim Ned,77.29,170.1,102.06,192.78,464.93,Single-ply,SBD,M
Boys,82.5,7,Donte Mitchell,Abilene Cooper,82.1,154.22,108.86,170.1,433.18,Single-ply,SBD,M
Boys,82.5,8,Cooper Graham,Anson,78.38,102.06,63.5,136.08,301.64,Single-ply,SBD,M
Boys,82.5,DQ,Xavier Rodriguez,Anson,77.11,,,,,Single-ply,SBD,M
Boys,82.5,DQ,Trey Thompson,Merkel,82.1,181.44,102.06,,,Single-ply,SBD,M
Boys,90,1,Actavias Lowry,Abilene Cooper,85.09,192.78,133.81,195.04,521.63,Single-ply,SBD,M
Boys,90,2,Junior Lawhon,Sweetwater,89.18,192.78,129.27,190.51,512.56,Single-ply,SBD,M
Boys,90,3,Braden Kesler,Tuscola Jim Ned,88.72,176.9,90.72,233.6,501.22,Single-ply,SBD,M
Boys,90,4,Houston Hance,Abilene Cooper,87.82,185.97,111.13,188.24,485.34,Single-ply,SBD,M
Boys,90,5,Leroy Santana,Abilene,85.09,183.7,104.33,156.49,444.52,Single-ply,SBD,M
Boys,90,6,Harold Collins,Abilene,88.99,170.1,95.25,165.56,430.91,Single-ply,SBD,M
Boys,90,7,Joe Valdez,Merkel,89.72,147.42,90.72,183.7,421.84,Single-ply,SBD,M
Boys,90,8,Justin Wright,Abilene Cooper,88.99,154.22,102.06,163.29,419.57,Single-ply,SBD,M
Boys,90,9,Jacob Turner,Tuscola Jim Ned,85.18,147.42,86.18,181.44,415.04,Single-ply,SBD,M
Boys,90,10,Richie Drew,Abilene Cooper,89.81,136.08,97.52,176.9,410.5,Single-ply,SBD,M
Boys,90,11,Ben Steele,Moran,89.36,163.29,92.99,149.69,405.97,Single-ply,SBD,M
Boys,90,12,Chance Moser,Clyde,87.09,151.95,88.45,147.42,387.82,Single-ply,SBD,M
Boys,90,13,Taylor Cullum,Merkel,85.37,117.93,79.38,138.35,335.66,Single-ply,SBD,M
Boys,100,1,Blake Parker,Abilene Cooper,99.52,222.26,136.08,188.24,546.58,Single-ply,SBD,M
Boys,100,2,Ryland Madrid,Abilene,94.35,208.65,106.59,197.31,512.56,Single-ply,SBD,M
Boys,100,3,Jax Pimentel,Clyde,99.61,199.58,129.27,183.7,512.56,Single-ply,SBD,M
Boys,100,4,Raymond Delgado,Sweetwater,98.7,181.44,124.74,195.04,501.22,Single-ply,SBD,M
Boys,100,5,Michael Martinez,Abilene,96.07,188.24,102.06,185.97,476.27,Single-ply,SBD,M
Boys,100,6,Monty Lancaster,Moran,93.17,181.44,97.52,172.37,451.32,Single-ply,SBD,M
Boys,100,7,Kendrick James,Abilene Cooper,97.52,158.76,104.33,181.44,444.52,Single-ply,SBD,M
Boys,100,8,Shane Thomas,Clyde,99.34,179.17,102.06,158.76,439.98,Single-ply,SBD,M
Boys,100,9,Andrew Purdun,Anson,99.79,165.56,106.59,167.83,439.98,Single-ply,SBD,M
Boys,100,10,Alex Ryan,Abilene,91.9,172.37,102.06,145.15,419.57,Single-ply,SBD,M
Boys,100,11,Israel DelaCruz,Anson,99.25,161.03,92.99,165.56,419.57,Single-ply,SBD,M
Boys,100,12,Dillon Slauenwhite,Clyde,98.7,147.42,102.06,156.49,405.97,Single-ply,SBD,M
Boys,100,13,Tristin Patterson,Tuscola Jim Ned,90.54,136.08,81.65,158.76,376.48,Single-ply,SBD,M
Boys,110,1,Haddan Stokes,Clyde,102.97,301.64,170.1,226.8,698.53,Single-ply,SBD,M
Boys,110,2,Dylan Jimenez,Sweetwater,107.32,226.8,127.01,210.92,564.72,Single-ply,SBD,M
Boys,110,3,Dylan Burnett,Tuscola Jim Ned,109.32,226.8,124.74,181.44,532.97,Single-ply,SBD,M
Boys,110,4,Bryce Templeton,Abilene Cooper,106.87,192.78,111.13,181.44,485.34,Single-ply,SBD,M
Boys,110,5,Peyton Weatherly,Tuscola Jim Ned,103.96,165.56,106.59,165.56,437.72,Single-ply,SBD,M
Boys,110,6,CJ Ugalde,Merkel,102.33,136.08,68.04,124.74,328.85,Single-ply,SBD,M
Boys,110,DQ,Brent Alexander,Abilene Cooper,107.77,226.8,,,,Single-ply,SBD,M
Boys,110,DQ,Jesus Lara,Abilene Cooper,103.42,170.1,,,,Single-ply,SBD,M
Boys,125,1,Jonathan Castaneda,Abilene Cooper,114.49,210.92,124.74,229.06,564.72,Single-ply,SBD,M
Boys,125,2,John Adkins,Clyde,111.04,215.46,120.2,215.46,551.11,Single-ply,SBD,M
Boys,125,3,Sammy Renteria,Abilene,120.02,219.99,104.33,183.7,508.02,Single-ply,SBD,M
Boys,125,4,Mekhi Reid,Abilene,120.11,183.7,122.47,192.78,498.95,Single-ply,SBD,M
Boys,125,5,Collin Gardner,Anson,116.21,181.44,111.13,151.95,444.52,Single-ply,SBD,M
Boys,125,6,Miguel Valdez,Clyde,112.13,136.08,97.52,131.54,365.14,Single-ply,SBD,M
Boys,125,DQ,Slayde Anderson,Abilene,117.57,,,,,Single-ply,SBD,M
Boys,125,DQ,Anthony Arellano,Abilene Cooper,116.57,224.53,129.27,,,Single-ply,SBD,M
Boys,125,DQ,Jeremiah Berrera,Sweetwater,124.56,204.12,,,,Single-ply,SBD,M
Boys,125,DQ,Evan Tate,Tuscola Jim Ned,121.83,233.6,,,,Single-ply,SBD,M
Boys,125,DQ,Anthony Koch,Clyde,124.74,226.8,120.2,,,Single-ply,SBD,M
Boys,125+,1,Jesus Verastegui,Abilene,149.59,272.16,151.95,254.01,678.12,Single-ply,SBD,M
Boys,125+,2,Ruben Leija,Abilene,147.15,201.85,140.61,215.46,557.92,Single-ply,SBD,M
Boys,125+,3,Marquise Lyons,Abilene,126.73,215.46,127.01,183.7,526.17,Single-ply,SBD,M
Boys,125+,4,Chris De La Garza,Clyde,134.72,201.85,108.86,185.97,496.68,Single-ply,SBD,M
Boys,125+,5,Jackson Sellers,Abilene,134.44,181.44,95.25,163.29,439.98,Single-ply,SBD,M
Boys,125+,6,Jonathan Pressley,Abilene Cooper,140.16,115.67,61.23,127.01,303.91,Single-ply,SBD,M
Boys,125+,DQ,Jaron Castillo,Anson,129.46,,,,,Single-ply,SBD,M
