Place,Name,Sex,Event,Division,WeightClassKg,Equipment,BirthYear,State,BodyweightKg,Squat1Kg,Squat2Kg,Squat3Kg,Best3SquatKg,Bench1Kg,Bench2Kg,Bench3Kg,Best3BenchKg,Deadlift1Kg,Deadlift2Kg,Deadlift3Kg,Best3DeadliftKg,TotalKg
1,Erika Lamb,F,B,R-O,84,Raw,1992,FL,82.3,,,,,90,95,-100,95,,,,,95
2,Kelly Hafkey,F,B,R-O,84,Raw,1981,FL,83.8,,,,,72.5,77.5,82.5,82.5,,,,,82.5
1,Alexander Carrillo,M,B,R-O,74,Raw,1992,FL,73.6,,,,,140,147.5,-152.5,147.5,,,,,147.5
1,Darian Bryant,M,B,R-O,93,Raw,1966,FL,84.3,,,,,165,-175,-175,165,,,,,165
1,Lisa Benitez,F,SBD,R-G,63,Raw,1994,FL,58.9,117.5,125,-130,125,52.5,57.5,-60,57.5,120,125,-127.5,125,307.5
1,Hannah Ghindea,F,SBD,R-G,72,Raw,1992,LA,69.9,110,117.5,-122.5,117.5,57.5,62.5,-65,62.5,140,150,-160,150,330
1,Mari Saydal,F,SBD,R-M2,84,Raw,1967,FL,81.95,-80,80,90,90,52.5,55,62.5,62.5,102.5,-115,-115,102.5,255
1,Floridel Jimenez,F,SBD,R-O,57,Raw,1991,AK,57,115,127.5,-132.5,127.5,60,65,70,70,125,135,142.5,142.5,340
2,Maria Pinto,F,SBD,R-O,57,Raw,1987,FL,56,92.5,100,-105,100,62.5,67.5,-70,67.5,110,122.5,-132.5,122.5,290
1,Lisa Stephens,F,SBD,R-O,63,Raw,1991,FL,60.25,97.5,102.5,105,105,-47.5,50,-55,50,107.5,112.5,117.5,117.5,272.5
2,Alexandra Quinones,F,SBD,R-O,63,Raw,1984,FL,58.15,80,87.5,-92.5,87.5,55,-60,-60,55,110,115,120,120,262.5
1,Monique Charlton,F,SBD,R-O,72,Raw,1983,FL,71.8,70,-82.5,-82.5,70,37.5,42.5,-50,42.5,100,107.5,117.5,117.5,230
1,Melissa Nadeau,F,SBD,R-O,84,Raw,1980,FL,82.8,112.5,117.5,-122.5,117.5,60,65,70,70,165,-175,185,185,372.5
2,Leah Heinzelmann,F,SBD,R-O,84,Raw,1993,FL,76.4,105,107.5,110,110,50,52.5,55,55,130,137.5,145,145,310
1,Dorothy Chan,F,SBD,R-T3,57,Raw,1999,FL,56.05,-90,92.5,-95,92.5,50,-55,55,55,100,105,112.5,112.5,260
1,Andrew Ming,M,SBD,R-G,59,Raw,1990,NJ,49,95,100,105,105,52.5,60,67.5,67.5,122.5,132.5,140,140,312.5
1,Joel Feinberg,M,SBD,R-G,93,Raw,1977,FL,89,160,170,175,175,115,-120,-120,115,227.5,-237.5,237.5,237.5,527.5
1,Tobias Bear,M,SBD,R-G,120,Raw,1992,FL,109,160,170,-175,170,-90,90,100,100,200,210,-215,210,480
1,Stephen Tham,M,SBD,R-JR,66,Raw,1996,FL,65.25,147.5,157.5,162.5,162.5,95,105,107.5,107.5,165,175,182.5,182.5,452.5
1,Luke Hatanaka,M,SBD,R-JR,74,Raw,1995,FL,71,175,185,192.5,192.5,140,147.5,152.5,152.5,195,205,-212.5,205,550
2,Edward Hernandez,M,SBD,R-JR,74,Raw,1994,FL,72.35,160,167.5,175,175,107.5,115,120,120,190,200,-210,200,495
1,Michael Rayo,M,SBD,R-JR,93,Raw,1995,FL,91.5,170,-187.5,-187.5,170,105,-127.5,-127.5,105,182.5,192.5,-235,192.5,467.5
1,Daniel Sanchez-Galarraga,M,SBD,R-M1,105,Raw,1977,FL,97.95,185,195,205,205,115,125,-130,125,227.5,240,250,250,580
1,Cedric Taylor,M,SBD,R-M1,120,Raw,1973,FL,116.2,205,225,240,240,-132.5,132.5,150,150,205,230,-240,230,620
1,Rodrigo Padilla,M,SBD,R-O,66,Raw,1978,FL,65.25,160,170,177.5,177.5,130,-132.5,132.5,132.5,192.5,195,212.5,212.5,522.5
2,Matthew Levit,M,SBD,R-O,66,Raw,1994,FL,64.85,160,167.5,172.5,172.5,95,-102.5,-102.5,95,182.5,195,200,200,467.5
1,Richard Llanes,M,SBD,R-O,74,Raw,1997,FL,73.9,200,-207.5,210,210,130,135,140,140,215,222.5,227.5,227.5,577.5
2,Luke Hatanaka,M,SBD,R-O,74,Raw,1995,FL,71,175,185,192.5,192.5,140,147.5,152.5,152.5,195,205,-212.5,205,550
3,Jake Lopez,M,SBD,R-O,74,Raw,1991,FL,71.55,172.5,182.5,190,190,100,110,115,115,210,220,227.5,227.5,532.5
4,Pedro Magalhaes,M,SBD,R-O,74,Raw,1992,FL,73.3,172.5,182.5,-192.5,182.5,122.5,132.5,-137.5,132.5,192.5,-207.5,-207.5,192.5,507.5
5,Edward Hernandez,M,SBD,R-O,74,Raw,1994,FL,72.35,160,167.5,175,175,107.5,115,120,120,190,200,-210,200,495
6,Imani Martinez,M,SBD,R-O,74,Raw,1993,FL,73.85,150,160,-167.5,160,102.5,112.5,115,115,190,200,-207.5,200,475
7,Alfredo Agusti,M,SBD,R-O,74,Raw,1990,FL,74,125,142.5,152.5,152.5,102.5,110,115,115,167.5,177.5,192.5,192.5,460
8,Christian Cameron,M,SBD,R-O,74,Raw,1986,FL,72.9,-140,140,-150,140,97.5,-102.5,-102.5,97.5,165,175,185,185,422.5
1,Adam Steede,M,SBD,R-O,83,Raw,1993,FL,82.3,235,245,252.5,252.5,140,147.5,152.5,152.5,272.5,290,302.5,302.5,707.5
2,Cristofer Martinez,M,SBD,R-O,83,Raw,1991,FL,82,207.5,215,220,220,150,160,165,165,235,-245,-245,235,620
3,Michael Izzolo,M,SBD,R-O,83,Raw,1993,FL,82.6,185,192.5,200,200,125,130,-132.5,130,210,220,230,230,560
4,Ricardo Porro,M,SBD,R-O,83,Raw,1994,FL,77.6,170,180,187.5,187.5,120,130,135,135,212.5,222.5,230,230,552.5
5,Neville Mathews,M,SBD,R-O,83,Raw,1994,FL,82.35,170,185,192.5,192.5,120,-130,-130,120,190,200,-215,200,512.5
6,Kevin Castroreyes,M,SBD,R-O,83,Raw,1992,FL,80.7,150,160,170,170,102.5,110,117.5,117.5,175,185,192.5,192.5,480
DQ,Joshua Rickey,M,SBD,R-O,83,Raw,1987,FL,81.35,200,215,227.5,227.5,-137.5,-145,-145,,-237.5,,,,
1,Anthony Loreto,M,SBD,R-O,93,Raw,1986,FL,92.35,240,252.5,265,265,152.5,160,165,165,290,305,-317.5,305,735
2,Mark Baquiran,M,SBD,R-O,93,Raw,1987,FL,88.65,182.5,197.5,205,205,145,152.5,-160,152.5,235,-242.5,242.5,242.5,600
3,Joey Lai,M,SBD,R-O,93,Raw,1990,FL,90.55,175,190,200,200,85,102.5,110,110,202.5,220,-225,220,530
4,Dennis Tolentino,M,SBD,R-O,93,Raw,1980,FL,92.9,-207.5,207.5,-210,207.5,100,-107.5,-107.5,100,205,215,220,220,527.5
1,Gianni Garces,M,SBD,R-O,105,Raw,1990,FL,99.3,205,220,240,240,130,140,150,150,220,235,250,250,640
2,Shaun Ottley,M,SBD,R-O,105,Raw,1991,FL,101.7,212.5,220,-225,220,150,155,162.5,162.5,-232.5,-232.5,240,240,622.5
3,Jorge López,M,SBD,R-O,105,Raw,1993,FL,98.05,180,187.5,197.5,197.5,110,120,-127.5,120,207.5,220,227.5,227.5,545
1,Shawn Kershner,M,SBD,R-O,120+,Raw,1986,FL,123.45,210,220,227.5,227.5,137.5,147.5,155,155,240,252.5,260,260,642.5
2,Shaun Krin,M,SBD,R-O,120+,Raw,1981,FL,128.3,195,205,-210,205,140,145,-150,145,250,260,-272.5,260,610
1,Peter Cocchiaro,M,SBD,R-T2,74,Raw,2002,FL,71.05,125,142.5,147.5,147.5,85,90,95,95,142.5,152.5,162.5,162.5,405
2,Mateo Perez,M,SBD,R-T2,74,Raw,2002,FL,66.55,-115,-115,115,115,80,-87.5,-87.5,80,145,155,160,160,355
1,Chase Rohwedder,M,SBD,R-T3,83,Raw,1999,FL,79.5,142.5,150,-162.5,150,102.5,110,120,120,185,-227.5,-227.5,185,455
1,Jason Gonzalez,M,SBD,R-Y2,53,Raw,2008,FL,50.25,40,42.5,45,45,20,22.5,25,25,45,52.5,57.5,57.5,127.5
