Division,WeightClassKg,Place,Name,Team,BodyweightKg,Best3SquatKg,Best3BenchKg,Best3DeadliftKg,TotalKg,Equipment,Event,Sex
Boys,52,1,Robert Gonzalez,Laredo Cigarroa,51.71,183.7,95.25,170.1,449.06,Single-ply,SBD,M
Boys,52,2,Danny Ruiz,Zapata,50.44,140.61,72.57,158.76,371.95,Single-ply,SBD,M
Boys,52,3,Oscar Martel,Laredo United South,48.08,138.35,83.91,133.81,356.07,Single-ply,SBD,M
Boys,52,4,Ramiro Trevino,Laredo Nixon,48.81,138.35,72.57,142.88,353.8,Single-ply,SBD,M
Boys,52,5,Aaron Fuentes,Zapata,50.35,122.47,72.57,140.61,335.66,Single-ply,SBD,M
Boys,56,1,Mario Saldivar,Laredo Alexander,55.7,174.63,97.52,195.04,467.2,Single-ply,SBD,M
Boys,56,2,Jesus Trevino,Zapata,54.7,176.9,95.25,192.78,464.93,Single-ply,SBD,M
Boys,56,3,David Lozano,Roma,52.8,138.35,70.31,131.54,340.19,Single-ply,SBD,M
Boys,56,4,Justin Brady,Carrizo Springs,53.71,113.4,65.77,161.03,340.19,Single-ply,SBD,M
Boys,56,5,Jerry Martinez,Laredo Johnson,54.34,120.2,68.04,124.74,312.98,Single-ply,SBD,M
Boys,56,DQ,Manuel Guevara,Laredo Nixon,55.79,102.06,,,,Single-ply,SBD,M
Boys,60,1,Mac Gomez,Zapata,58.33,226.8,102.06,204.12,532.97,Single-ply,SBD,M
Boys,60,2,Jeremine Jimenez,Laredo United South,59.69,142.88,92.99,185.97,421.84,Single-ply,SBD,M
Boys,60,3,Jose Alcorta,Laredo United South,56.97,142.88,86.18,158.76,387.82,Single-ply,SBD,M
Boys,60,4,Jonathan Diaz,Laredo Martin,59.69,151.95,70.31,163.29,385.55,Single-ply,SBD,M
Boys,67.5,1,Josue Tobias,Laredo Nixon,66.22,226.8,122.47,240.4,589.67,Single-ply,SBD,M
Boys,67.5,2,Oscar Galvan,Laredo United South,66.5,183.7,133.81,213.19,530.7,Single-ply,SBD,M
Boys,67.5,3,Marco Gomez,Crystal City,65.23,183.7,102.06,172.37,458.13,Single-ply,SBD,M
Boys,67.5,4,Bryan Garcia,Roma,65.23,176.9,106.59,165.56,449.06,Single-ply,SBD,M
Boys,67.5,5,Guillermo Compton,Laredo Alexander,64.23,154.22,97.52,185.97,437.72,Single-ply,SBD,M
Boys,67.5,6,Albert Betancourt,Laredo Johnson,65.32,158.76,79.38,181.44,419.57,Single-ply,SBD,M
Boys,67.5,7,Sergio Ponce,Laredo Martin,64.68,161.03,86.18,161.03,408.23,Single-ply,SBD,M
Boys,67.5,8,Joseph Lozano,Laredo Nixon,66.13,147.42,83.91,167.83,399.16,Single-ply,SBD,M
Boys,67.5,9,Felix Ruiz,Laredo Nixon,66.22,145.15,88.45,147.42,381.02,Single-ply,SBD,M
Boys,67.5,10,Joey Cardenas,Carrizo Springs,66.86,97.52,58.97,136.08,292.57,Single-ply,SBD,M
Boys,67.5,11,Tomas Montellano,Crystal City,64.86,90.72,58.97,102.06,251.74,Single-ply,SBD,M
Boys,67.5,DQ,Miguel Luna,Laredo Johnson,63.5,,,,,Single-ply,SBD,M
Boys,75,1,Rene Cabrera,Laredo Cigarroa,71.67,226.8,113.4,174.63,514.83,Single-ply,SBD,M
Boys,75,2,Gil Garcia,Crystal City,69.76,174.63,104.33,217.72,496.68,Single-ply,SBD,M
Boys,75,3,Eric Gonzales #2,Carrizo Springs,72.12,149.69,90.72,185.97,426.38,Single-ply,SBD,M
Boys,75,4,Frankie Mendez,Carrizo Springs,69.31,142.88,97.52,163.29,403.7,Single-ply,SBD,M
Boys,75,5,Johnny Guerrero,Laredo Nixon,74.39,147.42,83.91,167.83,399.16,Single-ply,SBD,M
Boys,75,6,Federico Mendez,Laredo Martin,69.67,147.42,83.91,165.56,396.89,Single-ply,SBD,M
Boys,82.5,7,Jesus Palmerin,Laredo Nixon,74.48,170.1,92.99,183.7,446.79,Single-ply,SBD,M
Boys,75,7,Jakoby Torres,Laredo Alexander,71.58,149.69,81.65,156.49,387.82,Single-ply,SBD,M
Boys,75,8,Micheal Martinez,Laredo Martin,70.4,142.88,83.91,151.95,378.75,Single-ply,SBD,M
Boys,75,9,Ricky Gomez,Laredo Nixon,71.94,136.08,77.11,165.56,378.75,Single-ply,SBD,M
Boys,75,10,Armando Villanueva,Laredo United,74.84,122.47,83.91,145.15,351.53,Single-ply,SBD,M
Boys,75,11,Jesse Ward,Bruni,68.86,106.59,56.7,120.2,283.5,Single-ply,SBD,M
Boys,75,DQ,Albert Garcia,Laredo Johnson,68.31,161.03,92.99,,,Single-ply,SBD,M
Boys,82.5,1,Kevin Martinez,Laredo United South,81.56,224.53,124.74,219.99,569.26,Single-ply,SBD,M
Boys,82.5,2,Manny Garza,Laredo United,80.01,204.12,129.27,217.72,551.11,Single-ply,SBD,M
Boys,82.5,3,Mauricio Vasquez,Laredo Alexander,80.47,231.33,92.99,167.83,492.15,Single-ply,SBD,M
Boys,82.5,4,Leo Benavides,Laredo Johnson,79.74,204.12,102.06,183.7,489.88,Single-ply,SBD,M
Boys,82.5,5,Matthew Embers,Carrizo Springs,77.29,190.51,99.79,183.7,474,Single-ply,SBD,M
Boys,82.5,6,Luis Rodriguez,Laredo Nixon,78.93,181.44,86.18,197.31,464.93,Single-ply,SBD,M
Boys,82.5,8,Pablo Ramirez,Laredo Alexander,75.93,136.08,77.11,145.15,358.34,Single-ply,SBD,M
Boys,82.5,DQ,Raul Solis,Laredo Cigarroa,78.02,136.08,,,,Single-ply,SBD,M
Boys,82.5,DQ,David Chapa,Laredo Nixon,80.56,170.1,,,,Single-ply,SBD,M
Boys,82.5,DQ,Victor Villarreal,Laredo Martin,79.74,201.85,,,,Single-ply,SBD,M
Boys,90,1,David Luna,Laredo Johnson,88.09,283.5,142.88,244.94,671.32,Single-ply,SBD,M
Boys,90,2,Omar Galan,Laredo Alexander,88,244.94,142.88,226.8,614.62,Single-ply,SBD,M
Boys,90,3,Dominic Rodriguez,Laredo Johnson,86.73,195.04,120.2,226.8,542.04,Single-ply,SBD,M
Boys,90,4,Greggorio Sandoval,Laredo Martin,88.9,199.58,108.86,188.24,496.68,Single-ply,SBD,M
Boys,90,5,Mark Puente,Crystal City,84.55,199.58,115.67,158.76,474,Single-ply,SBD,M
Boys,90,6,Luis Aguirre,Laredo Martin,88.63,156.49,83.91,158.76,399.16,Single-ply,SBD,M
Boys,90,7,Steven Muzquiz,Crystal City,82.46,124.74,83.91,172.37,381.02,Single-ply,SBD,M
Boys,90,8,Juan Oyervidez,Carrizo Springs,86.27,127.01,68.04,149.69,344.73,Single-ply,SBD,M
Boys,90,9,Lino Castro,Crystal City,89.81,108.86,63.5,108.86,281.23,Single-ply,SBD,M
Boys,90,DQ,Victor Mejia,Bruni,84.64,156.49,,,,Single-ply,SBD,M
Boys,100,1,Franco Arce,Zapata,99.06,278.96,129.27,240.4,648.64,Single-ply,SBD,M
Boys,100,2,Hugo Zamora,Laredo Cigarroa,95.25,256.28,149.69,210.92,616.89,Single-ply,SBD,M
Boys,100,3,Victor Lozano,Laredo Nixon,91.81,226.8,120.2,201.85,548.85,Single-ply,SBD,M
Boys,100,4,Daniel Uribe,Laredo Johnson,99.79,213.19,92.99,226.8,532.97,Single-ply,SBD,M
Boys,100,5,Ray Perez,Laredo Alexander,94.53,170.1,111.13,217.72,498.95,Single-ply,SBD,M
Boys,100,6,Luis De Luna,Laredo United South,91.99,183.7,120.2,190.51,494.42,Single-ply,SBD,M
Boys,100,7,Cruz Montez,Carrizo Springs,91.53,174.63,122.47,165.56,462.66,Single-ply,SBD,M
Boys,100,8,Jeffrey De Leon,Carrizo Springs,93.89,158.76,92.99,190.51,442.25,Single-ply,SBD,M
Boys,110,1,Eddie Dominguez,Laredo United,101.42,240.4,117.93,226.8,585.13,Single-ply,SBD,M
Boys,110,2,Emilio Alvarado,Crystal City,101.88,233.6,149.69,201.85,585.13,Single-ply,SBD,M
Boys,110,3,Abel Mendoza,Laredo Nixon,107.5,217.72,136.08,201.85,555.65,Single-ply,SBD,M
Boys,110,4,Michael Almedina,Zapata,104.14,204.12,104.33,226.8,535.24,Single-ply,SBD,M
Boys,110,5,Jesus Moreno,Laredo Alexander,101.15,167.83,106.59,190.51,464.93,Single-ply,SBD,M
Boys,110,6,Jesus Mercado,Roma,105.78,181.44,102.06,176.9,460.4,Single-ply,SBD,M
Boys,110,7,Eleazar Salvador Jr,Laredo United South,108.14,151.95,92.99,170.1,415.04,Single-ply,SBD,M
Boys,125,1,Francisco Torrecilla,Laredo Nixon,117.12,272.16,136.08,258.55,666.78,Single-ply,SBD,M
Boys,125,2,Erick Chapa,Zapata,118.84,272.16,145.15,235.87,653.17,Single-ply,SBD,M
Boys,125,3,Oscar Zepeda,Zapata,116.85,242.67,151.95,222.26,616.89,Single-ply,SBD,M
Boys,125,4,Jacob Reyna,Laredo Cigarroa,116.85,213.19,129.27,226.8,569.26,Single-ply,SBD,M
Boys,125,5,Marco Pardo,Laredo Cigarroa,116.12,179.17,79.38,197.31,455.86,Single-ply,SBD,M
Boys,125,6,Chris Iruegas,Laredo Alexander,113.85,158.76,108.86,174.63,442.25,Single-ply,SBD,M
Boys,125,7,Adrian Fuentes,Laredo Cigarroa,115.39,151.95,97.52,185.97,435.45,Single-ply,SBD,M
Boys,125,8,Justin Trevino,Laredo Martin,112.76,156.49,90.72,170.1,417.3,Single-ply,SBD,M
Boys,125,9,Simon Arenasas,Laredo Nixon,124.74,136.08,61.23,158.76,356.07,Single-ply,SBD,M
Boys,125,DQ,Max Villarreal,Laredo United,113.13,,,,,Single-ply,SBD,M
Boys,125,DQ,Eddie Villanueva,Laredo Cigarroa,122.92,,,,,Single-ply,SBD,M
Boys,125+,1,Hugo Martinez,Zapata,129.09,310.71,136.08,276.69,723.48,Single-ply,SBD,M
Boys,125+,2,Edward Gonzalez,Crystal City,129,292.57,158.76,229.06,680.39,Single-ply,SBD,M
Boys,125+,3,Jose Salvador,Laredo United South,140.25,260.82,170.1,249.48,680.39,Single-ply,SBD,M
Boys,125+,4,Mario Chavez,Carrizo Springs,185.97,231.33,176.9,240.4,648.64,Single-ply,SBD,M
Boys,125+,5,Jose Beltran,Laredo Martin,134.08,269.89,142.88,195.04,607.81,Single-ply,SBD,M
Boys,125+,6,Juan Vieyra,Laredo Johnson,139.43,204.12,127.01,217.72,548.85,Single-ply,SBD,M
Boys,125+,7,Luis Barron,Laredo Johnson,132.81,204.12,115.67,199.58,519.36,Single-ply,SBD,M
Boys,125+,8,Adrian Lomas,Crystal City,125.01,183.7,142.88,181.44,508.02,Single-ply,SBD,M
Boys,125+,9,Pablo Gonzalez,Roma,128.46,158.76,102.06,183.7,444.52,Single-ply,SBD,M
Boys,125+,10,Miguel Rubio,Laredo Alexander,138.35,161.03,97.52,176.9,435.45,Single-ply,SBD,M
Boys,125+,11,Arron Hernandez,Laredo Martin,126.1,151.95,97.52,165.56,415.04,Single-ply,SBD,M
