Name,Sex,Equipment,Event,Division,WeightClassKg,State,Best3SquatKg,Best3BenchKg,Best3DeadliftKg,TotalKg,Bench4Kg,Deadlift4Kg,Place
Brian Bouyer,M,Wraps,SBD,Pre-Teen,44,AL,54.43,31.75,77.11,163.29,,,1
Riley Burrows,M,Wraps,SBD,Teenage 13-15,75,NC,158.76,108.86,208.65,476.27,,,1
Spenser Jimick,M,Wraps,SBD,Teenage 16-17,67.5,VA,,,,,,,DQ
Colton Freeman,M,Wraps,SBD,Teenage 16-17,90,AR,199.58,142.88,240.4,582.86,,,1
Meliton Cancino,M,Wraps,SBD,Teenage 16-17,90,TN,181.44,136.08,213.19,530.71,,,2
Jared Melton,M,Wraps,SBD,Teenage 16-17,100,TN,197.31,104.33,206.38,508.02,,,1
Jonathan Campbell,M,Wraps,SBD,Juniors,90,AL,226.8,161.03,226.8,614.63,,,1
Jeremiah Benefield,M,Wraps,SBD,Juniors,90,KY,226.8,154.22,206.38,587.4,,,2
Kelly Burgin,F,Wraps,SBD,Open,52,TN,68.04,38.56,97.52,204.12,,,1
Robyn Blankenship,F,Wraps,SBD,Open,82.5,VA,208.65,127.01,199.58,535.24,,,1
Ambre Tarpley,F,Wraps,SBD,Open,110,TN,124.74,61.23,151.95,337.92,,,1
Jamie McDougal,M,Wraps,SBD,Open,75,AR,226.8,197.31,276.69,700.8,201.85,,1
Mark Melancon,M,Wraps,SBD,Open,82.5,FL,210.92,156.49,258.55,625.96,,,1
Mike Bishop,M,Wraps,SBD,Open,90,TN,258.55,176.9,297.1,732.55,,,1
Kelly Wolford,M,Wraps,SBD,Open,118,NC,240.4,161.03,254.01,655.44,,,1
Tony Lucus,M,Wraps,SBD,Open,125,TN,317.51,242.67,317.51,877.69,,,1
Michael Schultze,M,Wraps,SBD,Open,140,AL,278.96,197.31,294.84,771.11,,,1
Eric Whitfield,M,Wraps,SBD,Submasters,100,MS,258.55,163.29,276.69,698.53,,,1
Markcus Millner,M,Wraps,SBD,Submasters,140+,TN,249.48,158.76,285.76,694,,,1
Crayton Taylor,M,Wraps,SBD,Masters 60-64,118,GA,215.46,142.88,249.48,607.82,,,1
Corey Oakley,M,Single-ply,SBD,Teenage 16-17,75,TN,138.35,92.99,154.22,385.56,,,1
Brian Gravely,M,Single-ply,SBD,Juniors,82.5,NC,256.28,170.1,231.33,657.71,,,1
Amy Munsterman,F,Single-ply,SBD,Open,60,AL,129.27,61.23,138.35,328.85,,,1
Scott Sergeant,M,Single-ply,SBD,Open,82.5,TN,242.67,204.12,256.28,703.07,,,1
Mark Steel,M,Single-ply,SBD,Open,100,TN,278.96,192.78,242.67,714.41,,,1
Terry Burgin,M,Single-ply,SBD,Open,110,TN,272.16,199.58,238.14,709.88,,,1
Charles Bailey,M,Single-ply,SBD,Open,125,FL,455.86,297.1,335.66,1088.62,,,1
Jack Kottwitz,M,Single-ply,SBD,Open,140+,AL,365.14,288.03,240.4,893.57,,,1
Mark Steel,M,Single-ply,SBD,Police and Fire,100,TN,278.96,192.78,242.67,714.41,,,1
Michael Cochran,M,Single-ply,SBD,Submasters,60,AL,136.08,117.93,163.29,417.3,,,1
Mark Steel,M,Single-ply,SBD,Submasters,100,TN,278.96,192.78,242.67,714.41,,,1
Rodney Aulridge,M,Single-ply,SBD,Masters 40-44,60,TN,167.83,117.93,156.49,442.25,,,1
Chris Bryant,M,Single-ply,SBD,Masters 40-44,140,TN,242.67,183.7,192.78,619.15,,,1
Mark Patrick,M,Single-ply,SBD,Masters 45-49,110,GA,226.8,226.8,238.14,691.74,,,1
Timothy Greene,M,Single-ply,SBD,Masters 50-54,75,GA,174.63,136.08,222.26,532.97,,,1
Jim Elmore,M,Single-ply,SBD,Masters 60-64,90,TN,149.69,86.18,190.51,426.38,,,1
Natalie Harrington,F,Multi-ply,SBD,Open,56,OH,206.38,111.13,156.49,474,,,1
Laura Phelps-Sweatt,F,Multi-ply,SBD,Open,82.5,OH,337.93,226.8,238.14,802.87,,,1
Dana Shealey,F,Multi-ply,SD,Open,100,NJ,165.56,,142.88,308.44,,,1
Joey Billiot,M,Multi-ply,SBD,Open,82.5,LA,322.05,229.06,240.4,791.51,,,1
Tony Ramos,M,Multi-ply,SBD,Open,82.5,OH,,,,,,,DQ
Andy Haus,M,Multi-ply,SBD,Open,90,OH,331.12,226.8,276.69,834.61,,,1
Mike Maxwell,M,Multi-ply,SBD,Open,90,OH,328.85,222.26,258.55,809.66,,,2
Mike Hill,M,Multi-ply,SBD,Open,100,WV,369.68,235.87,278.96,884.51,,,1
John Brown,M,Multi-ply,SBD,Open,100,OH,356.07,272.16,249.48,877.71,,,2
Matt Christie,M,Multi-ply,SBD,Open,110,GA,394.63,274.42,294.84,963.89,,,1
Tom Hypes,M,Multi-ply,SBD,Open,110,OH,394.63,263.08,263.08,920.79,,,2
David Kuck,M,Multi-ply,SBD,Open,118,OH,299.37,294.84,267.62,861.83,,,1
Will Irby,M,Multi-ply,SBD,Open,125,AL,328.85,229.06,272.16,830.07,,,1
Shawn Nutter,M,Multi-ply,SBD,Open,125,OH,,,,,,,DQ
James Williams,M,Multi-ply,SBD,Open,140+,TN,439.98,317.51,285.76,1043.25,,,1
Ryan Rigdon,M,Multi-ply,SBD,Submasters,125,IN,351.53,303.91,249.48,904.92,,,1
Ed Clark,M,Multi-ply,SBD,Masters 40-44,110,IL,331.12,206.38,65.77,603.27,,,1
Chris Young,M,Multi-ply,SBD,Masters 40-44,125,WV,362.87,276.69,312.98,952.54,,,1
Frank Phillips,M,Multi-ply,SBD,Masters 40-44,125,TN,328.85,238.14,274.42,841.41,,,2
Bryan Claiborne,M,Multi-ply,SBD,Masters 45-49,125,TN,272.16,181.44,204.12,657.72,,,1
Riley Burrows,M,Raw,BD,Teenage 13-15,75,AL,,108.86,208.65,317.51,,,1
Seth Maddoni,M,Raw,BD,Teenage 16-17,110,TN,,99.79,192.78,292.57,,,1
Justin Richardson,M,Raw,BD,Teenage 18-19,82.5,MS,,174.63,274.42,449.05,,,1
Angela Adams,F,Raw,BD,Open,90,TN,,90.72,170.1,260.82,,174.63,1
Greg Brian,M,Raw,BD,Open,90,AL,,147.42,204.12,351.54,,,1
Terry Tucker,M,Raw,BD,Masters 40-44,100,AR,,158.76,306.17,464.93,,310.71,1
Lee Smith,M,Single-ply,BD,Teenage 16-17,118,GA,,183.7,226.8,410.5,,,1
Chris Stinson,M,Single-ply,BD,Open,140,TN,,254.01,249.48,503.49,,,1
Robbie Robinson,M,Single-ply,BD,Open,140,NC,,206.38,251.74,458.12,,,2
Chris Stinson,M,Single-ply,BD,Submasters,140,TN,,254.01,249.48,503.49,,,1
Kevin Lancaster,M,Multi-ply,BD,Juniors,90,GA,,151.95,201.85,353.8,,,1
Justin Abnee,M,Multi-ply,BD,Open,110,KY,,206.38,297.1,503.48,,,1
Kevin Dotson,M,Raw,B,Teenage 16-17,100,TN,,61.23,,61.23,,,1
Alex Spilce,M,Raw,B,Juniors,75,TN,,145.15,,145.15,,,1
Claude Bouyer,M,Raw,B,Juniors,82.5,AL,,181.44,,181.44,,,1
Kim Craft,F,Raw,B,Open,56,AL,,56.7,,56.7,,,1
Barb Page,F,Raw,B,Open,110,OH,,120.2,,120.2,,,1
Kim Craft,F,Raw,B,Submasters,56,AL,,56.7,,56.7,,,1
Jamie McDougal,M,Raw,B,Open,75,AR,,197.31,,197.31,201.85,,1
Joshua Duboise,M,Raw,B,Open,82.5,TN,,170.1,,170.1,,,1
Shane Everage,M,Raw,B,Open,90,KY,,190.51,,190.51,,,1
Greg Anderson,M,Raw,B,Open,100,TN,,226.8,,226.8,,,1
Dan Martin,M,Raw,B,Open,110,AR,,197.31,,197.31,,,1
Chris Whitt,M,Raw,B,Open,125,SC,,156.49,,156.49,,,1
David Shirley,M,Raw,B,Submasters,90,AR,,176.9,,176.9,,,1
Dedrick Henry,M,Raw,B,Submasters,90,GA,,174.63,,174.63,,,2
Roy Brown,M,Raw,B,Submasters,110,TX,,183.7,,183.7,,,1
CJ Potete,M,Raw,B,Submasters,140+,TN,,229.06,,229.06,,,1
Lee Morris,M,Raw,B,Masters 40-44,90,AL,,181.44,,181.44,,,1
Lee Morris,M,Raw,B,Masters 40-44,100,AL,,181.44,,181.44,,,1
Dan Martin,M,Raw,B,Masters 40-44,110,AR,,197.31,,197.31,,,1
Tom Hayes,M,Raw,B,Masters 45-49,100,AR,,170.1,,170.1,,,1
Khamaali Rowan,M,Raw,B,Masters 65-69,100,GA,,124.74,,124.74,,,1
Gerold Lambdin,M,Raw,B,Masters 70-74,110,TN,,108.86,,108.86,,,1
Nick Aube,M,Single-ply,B,Teenage 13-15,56,GA,,61.23,,61.23,,,1
Chaz Bentley,M,Single-ply,B,Teenage 13-15,60,GA,,90.72,,90.72,,,1
Ryan Patrick,M,Single-ply,B,Teenage 13-15,67.5,GA,,56.7,,56.7,,,1
Deborah Poynter,F,Single-ply,B,Masters 55-59,82.5,GA,,74.84,,74.84,,,1
Pegi Pepin,F,Single-ply,B,Masters 60-64,67.5,GA,,45.36,,45.36,,,1
Pat Davidson,F,Single-ply,B,Masters 60-64,90,GA,,45.36,,45.36,,,1
Brian Albert,M,Single-ply,B,Submasters,67.5,GA,,181.44,,181.44,,,1
Chris Neal,M,Single-ply,B,Submasters,75,MS,,206.38,,206.38,,,1
Ken Smith,M,Single-ply,B,Submasters,110,GA,,,,,,,DQ
Joey Murphy,M,Single-ply,B,Submasters,118,GA,,,,,,,DQ
Peter Lindstrom,M,Single-ply,B,Masters 40-44,100,GA,,124.74,,124.74,,,1
Allen Zimmerman,M,Single-ply,B,Masters 50-54,82.5,IN,,133.81,,133.81,,,1
Billy Graham,M,Single-ply,B,Masters 50-54,110,GA,,183.7,,183.7,,,1
Sean Russell,M,Multi-ply,B,Teenage 13-15,44,GA,,61.23,,61.23,,,1
Jonathan Britt,M,Multi-ply,B,Juniors,82.5,NC,,167.83,,167.83,,,1
Derek Minor,M,Multi-ply,B,Open,110,IN,,265.35,,265.35,,,1
Jeff Weaver,M,Multi-ply,B,Open,118,TN,,288.03,,288.03,,,1
Jason Lawson,M,Multi-ply,B,Open,125,TN,,283.5,,283.5,,,1
Paul Geryman,M,Multi-ply,B,Open,140,IN,,247.21,,247.21,,,1
Derek Minor,M,Multi-ply,B,Submasters,110,IN,,265.35,,265.35,,,2
Jason Lason,M,Multi-ply,B,Submasters,110,TN,,283.5,,283.5,,,1
Joey Smith,M,Multi-ply,B,Submasters,140,NC,,342.46,,342.46,,,1
Jeff Weaver,M,Multi-ply,B,Masters 40-44,118,TN,,288.03,,288.03,,,1
Ronnie Holden,M,Multi-ply,B,Masters 45-49,125,TN,,122.47,,122.47,,,1
Dan Goble,M,Multi-ply,B,Masters 50-54,110,IN,,238.14,,238.14,,,1
Jeff Huggart,M,Multi-ply,B,Masters 50-54,118,IN,,192.78,,192.78,,,1
Whitey Green,M,Multi-ply,B,Masters 55-59,140,SC,,,,,,,DQ
Alex Spilce,M,Wraps,S,Juniors,75,TN,181.44,,,181.44,,,1
Ryan Patrick,M,Raw,D,Pre-Teen,67.5,GA,,,127.01,127.01,,,1
Trey Wright,M,Raw,D,Teenage 16-17,118,AL,,,226.8,226.8,,,1
Alex Spilce,M,Raw,D,Juniors,75,TN,,,208.65,208.65,,,1
David Jacobo,M,Raw,D,Juniors,90,AR,,,244.94,244.94,,,1
Terry Tucker,M,Raw,D,Open,100,AR,,,306.17,306.17,,310.71,1
Albert Gavaldon,M,Raw,D,Masters 45-49,110,TN,,,181.44,181.44,,,1
Ken Smith,M,Single-ply,D,Submasters,110,GA,,,229.06,229.06,,,1
Chris Stinson,M,Single-ply,D,Submasters,140,TN,,,249.48,249.48,,,1
Dana Shealy,F,Multi-ply,D,Open,100,NJ,,,142.88,142.88,,,1
Joe Ladnier,M,Multi-ply,D,Open,100,MS,,,319.78,319.78,,,1
Gary Moody,M,Multi-ply,D,Submasters,125,TN,,,285.76,285.76,,,1
Kirk McLaughlin,M,Multi-ply,D,Submasters,125,TN,,,240.4,240.4,,,2
Jeff Huggart,M,Multi-ply,D,Masters 45-49,118,IN,,,263.08,263.08,,,1
Harry Lindstrom,M,Multi-ply,D,Masters 70-74,100,GA,,,163.29,163.29,,,1
