C:\Users\kahin\OneDrive\Documents\houssam_test\src\main\java\com\mycompany\junit_test\MessageService.java
C:\Users\kahin\OneDrive\Documents\houssam_test\src\main\java\com\mycompany\junit_test\Junit_Test.java
C:\Users\kahin\OneDrive\Documents\houssam_test\src\main\java\com\mycompany\junit_test\Perroquet.java
C:\Users\kahin\OneDrive\Documents\houssam_test\src\main\java\com\mycompany\junit_test\Calculatrice.java
