{
	"defaultSeverity": "error",
	"extends": [
		"tslint:recommended"
	],
	"jsRules": {},
	"rules": {
		"align": false,
		"binary-expression-operand-order": true,
		"curly": [
			true,
			"as-needed"
		],
		"comment-format": [
			true,
			"check-space"
		],
		"deprecation": true,
		"encoding": true,
		"file-name-casing": [
			true,
			"kebab-case"
		],
		"forin": false,
		"indent": [
			true,
			"tabs",
			4
		],
		"interface-name": false,
		"max-line-length": {
			"options": 140
		},
		"member-ordering": [
			true,
			{
				"order": [
					"static-field",
					"instance-field",
					"static-method",
					"instance-method"
				]
			}
		],
		"quotemark": [false],
		"semicolon": [
			true,
			"never"
		],
		"no-boolean-literal-compare": true,
		"no-consecutive-blank-lines": [
			true,
			3
		],
		"no-duplicate-imports": true,
		"no-irregular-whitespace": true,
		"no-this-assignment": true,
		"no-unnecessary-callback-wrapper": true,
		"no-void-expression": [true, "ignore-arrow-function-shorthand"],
		"no-bitwise": false,
		"no-string-literal": false,
		"newline-per-chained-call": false,
		"prefer-conditional-expression": true,
		"prefer-readonly": true,
		"prefer-switch": true,
		"prefer-while": true,
		"static-this": true,
		"triple-equals": false,
		"no-unused-variable": [
			true,
			{ "ignore-pattern": "^_" }
		],
		"object-literal-sort-keys": false,
		"whitespace": [
			true,
			"check-branch",
			"check-decl",
			"check-module",
			"check-separator",
			"check-rest-spread",
			"check-type",
			"check-typecast",
			"check-type-operator",
			"check-preblock"
		]
	},
	"rulesDirectory": []
}
