{
  "variables": {
          "GCP_PROJECT_ID": "{{env `GCP_PROJECT_ID`}}",
          "IMAGE_TAG": "{{env `IMAGE_TAG`}}",
          "IMAGE_SUFFIX": "{{env `IMAGE_SUFFIX`}}",
          "CI_REGISTRY":"{{env `CI_REGISTRY`}}",
          "CI_REGISTRY_USER":"{{env `CI_REGISTRY_USER`}}",
          "CI_REGISTRY_IMAGE":"{{env `CI_REGISTRY_IMAGE`}}",
          "CI_REGISTRY_PASSWORD":"{{env `CI_REGISTRY_PASSWORD`}}",
          "images":"{{env `images`}}"
  },
  "builders": [
    {
      "type": "googlecompute",
      "account_file": "account.json",
      "project_id": "{{user `GCP_PROJECT_ID`}}",
      "source_image_family": "coreos-stable",
      "source_image": "coreos-stable-2023-4-0-v20190226",
      "image_family": "omnibus-builder",
      "image_name": "omnibus-builder-{{user `IMAGE_SUFFIX`}}",
      "zone": "us-central1-a",
      "ssh_username": "core",
      "disk_size": "30",
      "state_timeout": "15m"
    }
  ],
  "provisioners": [
    {
      "type": "shell",
      "script": "provisioner.sh",
      "environment_vars": [
              "IMAGE_TAG={{user `IMAGE_TAG`}}",
              "CI_REGISTRY={{user `CI_REGISTRY`}}",
              "CI_REGISTRY_IMAGE={{user `CI_REGISTRY_IMAGE`}}",
              "CI_REGISTRY_USER={{user `CI_REGISTRY_PASSWORD`}}",
              "CI_REGISTRY_PASSWORD={{user `CI_REGISTRY_PASSWORD`}}",
              "images={{user `images`}}"
      ]
    }
  ]
}
