{
    "uid": "BD_PY_ALGO_SORT",
    "TRN_EVL_ID": "IDF",
    "NETWORK": "COMMERCIAL",
    "KSATs": [
        [
            "K0133",
            "B"
        ],
        [
            "K0134",
            "B"
        ],
        [
            "K0135",
            "B"
        ],
        [
            "K0136",
            "B"
        ],
        [
            "K0137",
            "B"
        ],
        [
            "A0093",
            "2"
        ]
    ],
    "course": "IDF",
    "module": "Python",
    "topic": "Algorithms",
    "subject": "Sort",
    "lecture_time": 0,
    "perf_demo_time": 0,
    "references": [],
    "lesson_objectives": [
        {
            "description": "",
            "proficiency_level": "",
            "KSATs": [],
            "MSBs": []
        }
    ],
    "performance_objectives": [
        {
            "description": "",
            "KSATs": []
        }
    ],
    "workroles": [
        "basic-dev"
    ]
}