{
    "uid": "BD_PY_FLCON_IOF",
    "TRN_EVL_ID": "IDF",
    "NETWORK": "COMMERCIAL",
    "KSATs": [
        [
            "S0037",
            "3"
        ],
        [
            "S0038",
            "3"
        ],
        [
            "S0039",
            "3"
        ],
        [
            "S0040",
            "3"
        ],
        [
            "S0041",
            "3"
        ],
        [
            "K0037",
            "A"
        ],
        [
            "K0038",
            "A"
        ],
        [
            "K0039",
            "A"
        ],
        [
            "K0040",
            "A"
        ],
        [
            "K0041",
            "A"
        ],
        [
            "A0047",
            "3"
        ],
        [
            "K0062",
            "B"
        ],
        [
            "K0685",
            "B"
        ],
        [
            "K0741",
            "B"
        ],
        [
            "K0742",
            "B"
        ],
        [
            "K0743",
            "B"
        ],
        [
            "K0744",
            "B"
        ],
        [
            "K0745",
            "B"
        ]
    ],
    "course": "IDF",
    "module": "Python",
    "topic": "flow_control",
    "subject": "io_files",
    "lecture_time": 0,
    "perf_demo_time": 0,
    "references": [],
    "lesson_objectives": [],
    "performance_objectives": [],
    "workroles": [
        "basic-dev"
    ]
}