{
    "uid": "BD_PY_ADVNCD_DP",
    "TRN_EVL_ID": "IDF",
    "NETWORK": "COMMERCIAL",
    "KSATs": [
        [
            "K0042",
            "B"
        ],
        [
            "K0043",
            "B"
        ],
        [
            "K0044",
            "B"
        ],
        [
            "K0681",
            "B"
        ]
    ],
    "course": "IDF",
    "module": "Python",
    "topic": "Advanced",
    "subject": "design_patterns",
    "lecture_time": 30,
    "perf_demo_time": 60,
    "references": [],
    "lesson_objectives": [
        {
            "description": "Describe design patterns in Python",
            "proficiency_level": "B",
            "KSATs": [
                
            ],
            "MSBs": [

            ]
        }
    ],
    "performance_objectives": [
    ],
    "workroles": [
        "basic-dev"
    ]
}