{
    "uid": "BD_PY_OOP_USRCLS",
    "TRN_EVL_ID": "IDF",
    "NETWORK": "COMMERCIAL",
    "KSATs": [
        [
            "K0032",
            "C"
        ],
        [
            "K0033",
            "C"
        ],
        [
            "K0034",
            "B"
        ],
        [
            "K0037",
            "A"
        ],
        [
            "K0038",
            "A"
        ],
        [
            "K0040",
            "A"
        ],
        [
            "A0726",
            "3"
        ],
        [
            "A0727",
            "3"
        ],
        [
            "A0729",
            "3"
        ]
    ],
    "course": "IDF",
    "module": "Python",
    "topic": "oop",
    "subject": "user_classes",
    "lecture_time": 60,
    "perf_demo_time": 120,
    "references": [],
    "lesson_objectives": [
        {
            "description": "Comprehend Python objects",
            "KSATs": [
                "K0033"
            ],
            "MSBs": [
                {
                    "description": "Comprehend Python classes",
                    "KSATs": [
                        "K0032"
                    ]
                },
                {
                    "description": "Differentiate between Python objects and classes",
                    "KSATs": [
                        "K0034"
                    ]
                }
            ]
        },
        {
            "description": "Explain the Python keyword super",
            "KSATs": [
                "K0037"
            ],
            "MSBs": []
        },
        {
            "description": "Explain Python object initialization",
            "KSATs": [
                "K0038"
            ],
            "MSBs": []
        },
        {
            "description": "Explain Python object attributes",
            "KSATs": [
                "K0040"
            ],
            "MSBs": []
        }
    ],
    "performance_objectives": [
        {
            "description": "Write a class in Python",
            "KSATs": [
                "A0726"
            ]
        },
        {
            "description": "Instantiate a Python object",
            "KSATs": [
                "A0727"
            ]
        },
        {
            "description": "Write a class constructor",
            "KSATs": [
                "A0729"
            ]
        }
    ],
    "workroles": [
        "basic-dev"
    ]
}