%YAML 1.1
%TAG !u! tag:unity3d.com,2011:
--- !u!114 &11400000
MonoBehaviour:
  m_ObjectHideFlags: 0
  m_CorrespondingSourceObject: {fileID: 0}
  m_PrefabInstance: {fileID: 0}
  m_PrefabAsset: {fileID: 0}
  m_GameObject: {fileID: 0}
  m_Enabled: 1
  m_EditorHideFlags: 0
  m_Script: {fileID: 11500000, guid: 53af0e562187b1f49acdafb1995b29e1, type: 3}
  m_Name: Apple
  m_EditorClassIdentifier: 
  goldWorth: 172
  scrapWorth: 54
  itemType: 1
  inventorySprite: {fileID: 21300000, guid: 0860a0c4ca6147f448bfa1134714ff6c, type: 3}
  displayName: Apple
