{"properties": [
  {
    "name": "spring.cloud.stream.kafka.binder.defaultZkPort",
    "type": "java.lang.String",
    "description": "A description for 'spring.cloud.stream.kafka.binder.defaultZkPort'"
  },
  {
    "name": "spring.cloud.stream.kafka.binder.defaultBrokerPort",
    "type": "java.lang.String",
    "description": "A description for 'spring.cloud.stream.kafka.binder.defaultBrokerPort'"
  }
]}