[
  {
    "Nimi": "Hiir",
    "Distants": 100.0,
    "Aeg": 10.0,
    "Kiirus": 10.0
  },
  {
    "Nimi": "Jänes",
    "Distants": 100.0,
    "Aeg": 12.0,
    "Kiirus": 8.3333333333333339
  },
  {
    "Nimi": "Konn",
    "Distants": 100.0,
    "Aeg": 40.0,
    "Kiirus": 2.5
  },
  {
    "Nimi": "Hurt",
    "Distants": 100.0,
    "Aeg": 9.0,
    "Kiirus": 11.111111111111111
  },
  {
    "Nimi": "Põder",
    "Distants": 100.0,
    "Aeg": 15.0,
    "Kiirus": 6.666666666666667
  },
  {
    "Nimi": "Hiir",
    "Distants": 200.0,
    "Aeg": 25.0,
    "Kiirus": 8.0
  },
  {
    "Nimi": "Jänes",
    "Distants": 200.0,
    "Aeg": 20.0,
    "Kiirus": 10.0
  },
  {
    "Nimi": "Konn",
    "Distants": 200.0,
    "Aeg": 80.0,
    "Kiirus": 2.5
  },
  {
    "Nimi": "Hurt",
    "Distants": 200.0,
    "Aeg": 50.0,
    "Kiirus": 4.0
  },
  {
    "Nimi": "Mäger",
    "Distants": 200.0,
    "Aeg": 120.0,
    "Kiirus": 1.6666666666666667
  },
  {
    "Nimi": "Hunt",
    "Distants": 400.0,
    "Aeg": 62.0,
    "Kiirus": 6.4516129032258061
  },
  {
    "Nimi": "Jänes",
    "Distants": 400.0,
    "Aeg": 55.0,
    "Kiirus": 7.2727272727272725
  },
  {
    "Nimi": "Konn",
    "Distants": 400.0,
    "Aeg": 180.0,
    "Kiirus": 2.2222222222222223
  },
  {
    "Nimi": "Hurt",
    "Distants": 400.0,
    "Aeg": 90.0,
    "Kiirus": 4.4444444444444446
  },
  {
    "Nimi": "Mäger",
    "Distants": 400.0,
    "Aeg": 235.0,
    "Kiirus": 1.7021276595744681
  }
]