[{"id":1,"Login":"tcushelly0","password":"wRMDiD","category":"Film"},
{"id":2,"Login":"hsygrove1","password":"0qJ8E2tF8i","category":"Film"},
{"id":3,"Login":"wmcanellye2","password":"LPrCdQWX6qd2","category":"Film"},
{"id":4,"Login":"sdomenicone3","password":"JhiDPy8v","category":"Theatre"},
{"id":5,"Login":"dhouten4","password":"QeWa9LNnDy7","category":"Film"},
{"id":6,"Login":"lsallowaye5","password":"LPA1n0KZ3HNw","category":"Sports"}]