module gitlab.com/k33g/hello-function

go 1.17

require github.com/tidwall/gjson v1.14.0

require (
	github.com/tidwall/match v1.1.1 // indirect
	github.com/tidwall/pretty v1.2.0 // indirect
	github.com/tidwall/sjson v1.2.4
)
