{
    "profiles": {
      "hello-wasm-app": {
        "commandName": "Project",
        "launchBrowser": true,
        "environmentVariables": {
          "ASPNETCORE_ENVIRONMENT": "Development"
        },
        "applicationUrl": "https://localhost:7218;http://localhost:5076",
        "inspectUri": "{wsProtocol}://{url.hostname}:{url.port}/debug?browser={browserInspectUri}"
      }
    }
}
