{
  "dialog_alert_cannot_be_selected_startdate_from_month_closed": "Başlangıç tarihi dönemi kapanmış ay içerisinden seçilemez.",
  "dialog_alert_cannot_be_selected_enddate_earlier_start_date": "Proje bitiş tarihi daha önce seçilmiş olan bitiş tarihinden önce ki bir tarih olamaz.",
  "dialog_alert_missing_fields": "Eksik alanların doldurulması gerekmektedir.",
  "dialog_alert_using_wbs_code": " Bu WBS kodu halihazırda kullanılmaktadır. Lütfen farklı bir WBS kodu deneyiniz.",
  "dialog_alert_cannot_be_the_same_delivery_lead_start_date": "Teslimat Lideri'nin başlangıç tarihi daha önce belirlenmiş Teslimat Lideri'nin başlangıç tarihi ile aynı veya eski olamaz.",
  "dialog_alert_cannot_be_the_delivery_lead_start_date": "Teslimat Lideri'nin başlangıç tarihi proje başlangıç tarihinden eski veya yeni olamaz.",
  "dialog_alert_provide_customer_desciprtion": "Lütfen ilgili talep için bir müşteri tanımı yapınız.",
  "dialog_alert_upload_forecast_data": "Lütfen proje kapsamında yer alan tahmin verisini yükleyiniz.",
  "dialog_alert_cannot_be_selected_receipt_date_from_month_close": "Fiş tarihi kapanmış yıl içerisinden seçilemez. Lütfen mevcut yıl içerisinden bir tarih seçiniz.",
  "dialog_alert_one_more_than_rate": "Aynı tarih aralığını kapsayan birden fazla Rate verisi girişi yapılamaz.",
  "dialog_alert_one_more_than_level_rate": "Aynı tarih aralığını kapsayan birden fazla Seviye-Rate verisi girişi yapılamaz",
  "dialog_alert_one_more_then_id_rate": "Aynı tarih aralığını kapsayan birden fazla ID-Rate verisi girişi yapılamaz.",
  "dialog_alert_cannot_be_deleted_converted_project": "Proje olarak oluşturulmuş bir talep dosyası silinemez.",
  "dialog_alert_not_authorized_delete_project_request": "Proje talebi içerisinden doküman silmeye yetkiniz bulunmamaktadır",
  "dialog_alert_select_document_type": "Lütfen yüklemek istediğiniz dokümanın tipini seçiniz.",
  "dialog_alert_forecast_start_end_dates_fields": "Bitiş tarihi başlangıç tarihinden eski olmamalıdır.",
  "dialog_alert_forecast_start_end_timeperiod_dates_fields": "İçinde bulunulan aktif dönemden daha eski bir tarih seçilmemelidir.",
  "dialog_alert_delivery_lead_active_time_period": "Teslimat Lideri'nin tarihi aktif time period tarihinden büyük olamaz.",
  "dialog_alert_cannot_be_deleted_passive_project": "Doküman silinemez.",
  "dialog_alert_delivery_lead_active_time_period_alert": "Teslimat Lideri'nin tarihi aktif time period tarihinden küçük olamaz.",
  "label_dialog_expense_form_remove_alert": "Masraf formunu sildiğinizde girmiş olduğunuz masraflarda silinecektir.  Silmek istediğinizden emin misiniz?",
  "dialog_company_expense_date_alert": "Masraf Kalemi ileri bir tarih olarak sadece bir ay ileri dönem için kaydedilebilir.",
  "dialog_project_forecast_pricing_alert": "Proje başlangıç ve bitiş tarihi fiyatlandırma tahminin başlangıç ve bitiş tarihi ile aynı olmalıdır. Lütfen kontrol ediniz.",


  "label_converted_project":"Projeye Dönüştürüldü",
  "label_submitted_project_approval":"Proje Onayına Gönderildi",  
  "label_total_cost":"Toplam Gider",

  "label_active_period":"Aktif Dönem",

  "label_form_no":"Form No",
  "label_form_wbs":"İlgili Form WBS",
  "label_total_amount":"Toplam Tutar",
  "label_date_submitted_for_approval":"Onaya Gönderilen Tarih",
  "label_approved_rejected_date":"Onaylanan/Reddedilen Tarih",
  "label_form_status":"Durum",
  "label_approve": "Onayla",

  "label_selection_is_mandatory_ode_entry":"Plan girişi için proje seçimi zorunludur",
  "label_incomes":"Gelirler",
  "label_expenses":"Masraflar",
  "label_cci":"CCI",

  "label_selected_files":"Seçilen Dosyalar",
  "label_uploaded_files":"Yüklenmiş Dosyalar",

  "label_redirecting":"Yönlendiriliyorsunuz...",

  "label_exited":"Çıkış Yapıldı",

  "label_no_file_choosen":"Dosya seçmek için tıklayınız.",
  "label_sort":"Sırala",

  "label_new_expense_form":"Yeni Masraf Formu",

  "label_xtre": "Xtre",
  "label_finance": "Proje Finans",
  "label_expense": "Masraf",
  "label_documents": "Dökümanlar",
  "label_timesheet": "Zaman Çizelgesi",
  "label_pricing": "Pricing",
  "label_client_pricing": "Müşteri-Fiyatlandırma",
  "label_report": "Rapor",
  "label_notifications": "Bildirimler",
  "label_settings": "Ayarlar",
  "label_customer": "Müşteri",
  "label_project":"Proje",
  "label_closex": "Kapat",
  "label_see-all": "Tümünü gör",
  "label_invoices": "Faturalar",
  "label_reports": "Raporlar",
  "label_accounting": "Muhasebe",
  "label_resource_management": "Kaynak Yönetimi",
  "label_ode_period": "ODE Dönem",
  "label_date": "Tarih",
  "label_page": "Sayfa",
  "label_abouth": "İlgili",
  "label_title": "Başlık",
  "label_period_close": "Dönem Kapanış",
  "label_vatAmount": "KDV’li Tutar",
  "label_related_person": "İlgili Kişi",
  "label_info": "Bilgi",
  "label_add_invoice": "Fatura Ekle",
  "label_work_report": "Çalışma Raporu",
  "label_calculation_invoice": "Fatura Hesaplama",
  "label_description_invoice": "Fatura Bilgileri",
  "label_add_resource": "Kaynak Ekle",
  "label_add_customer": "Müşteri Ekle",
  "label_add_user": "Kullanıcı Ekle",
  "label_add_wbs": "WBS Ekle",
  "label_add_subcompany": "Alt Şirket Ekle",
  "label_add_expense": "Masraf Ekle",
  "label_assing_timesheet": "Zaman çizelgesi Atama",
  "label_assing_review": "Gözlemci Atama",
  "label_assing_permission": "Yetki Atama",
  "label_assing_expense": "Masraf Atama",
  "label_people": "Kişiler",
  "label_time_unit": "Zaman Birimi",
  "label_wbs_code": "WBS Kodu",
  "label_institution": "Kurum",
  "label_new_expense": "Yeni Masraf",
  "label_timesheet-add": "Zaman Girişi",
  "label_month": "Ay",
  "label_quarter-to-date": "Çeyrekten Tarihe",
  "label_year-to-date": "Yıldan Güne",
  "label_annual-leave-balance": "Yıllık İzin Bakiyesi",
  "label_chargeability": "Chargeability",
  "label_days": "gün",
  "label_used": "Kullanılan",
  "label_remaning": "Kalan",
  "label_hour": "Saat",
  "label_hour_cap": " Saat : ",
  "label_minute": "Dakika",
  "label_sum": "Toplam",
  "label_edit": "Düzenle",
  "label_description": "Açıklama",
  "label_processing":"İşleniyor",
  "label_report_name":"Rapor Adı",
  "label_report_list":"Rapor Listesi",
  "label_usd":"USD",
  "label_tr":"TRY",
  "label_eur":"EUR",
  "label_gbp":"GBP",
  "label_period":"Dönem",
  "label_authorization": "Yetki Yönetimi",
  "label_please_select_forecast":"Lütfen Tahmin Seçiniz",
  "label_select_forecast":"Tahmin Seçiniz.",
  "label_notification_detail":"Notifikasyon Detay",

  "label_minute_short": "dk",
  "label_hour_short": "sa",

  "label_mon": "Pzt",
  "label_tue": "Sal",
  "label_wed": "Çar",
  "label_thu": "Per",
  "label_fri": "Cum",
  "label_sat": "Cts",
  "label_sun": "Paz",

  "label_jan": "Ocak",
  "label_feb": "Şubat",
  "label_mar": "Mart",
  "label_apr": "Nisan",
  "label_may": "Mayıs",
  "label_jun": "Haziran",
  "label_jul": "Temmuz",
  "label_aug": "Ağustos",
  "label_sep": "Eylül",
  "label_oct": "Ekim",
  "label_nov": "Kasım",
  "label_dec": "Aralık",

  
  "label_total": "Toplam",
  "label_status": "Durum",

  "label_add-row": "Satır Ekle",
  "label_submit": "Gönder",
  
  "label_name": "Kullanıcı Adı",
  "label_enterprisename": "Kurumsal Adı",
  "label_password": "Şifre",
  "label_current_password": "Eski Şifre",
  "label_new_password": "Yeni Şifre",
  "label_confirm_new_password": "Yeni Şifre Onay",
  "label_language": "Dil",
  "label_no_text": "Hayır",
  "label_yes_text": "Evet",
  "label_excel_export": "Excel Dosyası İndir",
  "label_bring": "Getir",
  "label_send": "Gönder",
  "label_exit": "Çıkış",
  "label_reject": "Reddet",
  "label_back": "Geri",
  "label_show": "Göster",
  "label_back_changes": "Değişiklikleri Geri Al",  
  "label_user_email":"E-Mail",

  "Forecast_Name_Exists": "Tahmin adi bulunuyor. Lütfen, farklı bir isim seçimi yapınız.",
  "operation_success": "İşleminiz tamamlandı.",
  "operation_failed": "İşleminiz tamamlanamadı.",
  "approve_update": "bilgileri güncellenecektir , onaylıyor musunuz?",
  "approve_delete": "Silmek istediğinize emin misiniz?",
  "wrong_captcha": "Captcha kodunu hatalı girdiniz. Lütfen tekrar deneyiniz.",
  "role_cannot_be_deleted": "Silmek istediğiniz rolde kullanıcılar bulunduğu için rol silinemez.",
  "passwords_does_not_match": "Girdiğiniz şifreler eşleşmemektedir.",
  "passwords_identical": "Eski şifre ve yeni şifre aynı.",
  "fill_empty_fields": "*Kırmızı alanları doldurmanız gerekmektedir.",
  "password_requirements_not_match" :"Şifre gereksinimleri karşılamıyor.",
  "wbs_lenght_warning":"*WBS 14 karakter olmalıdır.",
  "date_must_be_big": "Bitiş tarihi başlangıç tarihinden büyük olmalıdır.",

  "client_management_code_length_validaitons": "Kod 3 haneli olmak zorundadır.",
  "client_management_tax_length_validaitons": "Vergi numarası 10 haneli olmak zorundadır.",
  "company_management_code_length_validaitons": "Şirket kodu 5 haneli olmak zorundadır.",
  "resource_management_empty_areas": "Kullanıcı adı, ad, soyad, iş gücü, çalışma yeri ve level alanları zorunludur.",
  "resource_management_wrong_format_username": "Kullanıcı adı alanının formatı eksik veya yanlıştır. Lütfen Türkçe karakter kullanmayınız. (Örnek: ayca.degirmenci, gulsum.gormez)",
  "resource_management_wrong_format_mail": "E-mail alanının formatı eksik veya yanlıştır. Lütfen Türkçe karakter kullanmayınız. (Örnek: ayca.degirmenci, gulsum.gormez)",
  "resource_management_cant_update_username": "Kullanıcı adı alanı güncellenemez.",
  "expense_search_empty_client": "Arama yapabilmek için bir adet müşteri seçmek zorunludur.",
  "cannot_be_less_end_data":"Bitiş tarihi mevcut bitiş tarihinden daha eski olamaz.",
  "forecast_empty_array_update":"Değiştirilmiş hücre bulunamadı.",
  "forecast_Revenue_and_Chargeable_expense_sum_should_equal_Billing":"Gelir ve Müşteriye Faturalandırılan Giderler toplamınız Faturalama tutarına eşit olmalıdır.",
  "forecast_period_is_not_interval": "Girmiş olduğunuz period proje tarihler arasında bulunmamaktadır.",
  "login_empty_role": "Sistem de tanımlı hiç rolünüz bulunmamaktadır.",
  "forecast_save_before_send_approve":"Forecast'i approve'a göndermeden önce değişiklikleri kaydediniz.",

  "transaction_code":"Takip Kodu: ",
  "error_400": "İstek sunucu tarafından işlenemiyor.",
  "error_401": "Oturumunuzun süresi dolmuştur.",
  "error_403": "Lütfen uygulama yöneticisi ile iletişime geçerek kullanıcı yetkisi tanımlatınız.",
  "error_423": "Modül şu an için aktif değildir.",
  "error_500": "Sistemsel bir hata oluştu. Lütfen daha sonra tekrar deneyiniz.",
  "error_10001": "Kullanıcı e-mail ya da şifre hatalı.",
  "error_10101": "Bu maile ait kullanıcı tanımı bulunamamıştır.",
  "error_10102": "Girdiğiniz email ile kayıtlı kullanıcı sistemde bulunmaktadır.",
  "error_10201": "Bu maile ait şirket bulunamamıştır.",
  "error_10202": "Girdiğiniz email ile kayıtlı şirket sistemde bulunmaktadır.",
  "error_10103": "Girdiğiniz email ile kayıtlı kullanıcı pasif durumdadır.",
  "error_10104": "Aktivasyon maili kullanılmış ya da zaman aşımına uğramış.",
  "error_10105": "Kullanıcı kayıt sırasında bir hata meydana geldi.",
  "error_11101": "Müşteri ekleme operasyonu başarısız.",
  "error_11103": "Müşteri güncelleme operasyonu başarısız.",
  "error_11105": "Mevcutta bu KOD kullanılmaktadır, yeni bir KOD girişi yapınız!",
  "error_11201": "Kaynak ekleme operasyonu başarısız.",
  "error_11203": "Kaynak güncelleme operasyonu başarısız.",
  "error_11205": "Aynı kullanıcı adı ile birden fazla kaynak oluşturulamaz.",
  "error_11206": "Aynı kullanıcı maili ile birden fazla kaynak oluşturulamaz.",
  "error_11605": "Mevcutta bu KOD kullanılmaktadır, yeni bir KOD girişi yapınız!",
  "error_20000":"Dosya yükleme işlemi tamamlanamadı.",
  "error_20002": "Bu kayıdın aktif kullanıcı ataması yapılmış.",
  "error_20003": "Bu kayıdın dosyası kopyalanamadı.",
  "error_30000": "Oluşturmak istediğiniz taslak mevcutta bulunmaktadır. Güncellemeleriniz için taslak listesine gidiniz.",
  "error_30001": "Bu kriterlere sahip taslak mevcutta bulunmamaktadır. Eklemek için taslak yönetim ekranına gidiniz.",
  "error_31101": "Onay gönderimi işlemi tamamlanamadı.",
  "error_31102": "Masraf onaylama/reddetme işlemi tamamlanamadı.",
  "error_32101": "İlgili kullanıcı ilgili WBS için tanımlıdır.",
  "error_32102": "İlgili kullanıcı gözlemci olarak tanımlıdır.",
  "error_32103": "Kendi kullanıcınızı gözlemci olarak ekleyemezsiniz.",
  "error_40001": "Mailiniz gönderilemedi.",
  "error_40101": "Fiş tarihi masraf formu döneminden ileri bir tarih olamaz. Lütfen yeni masraf formu oluşturup tekrar deneyiniz.",
  "error_40102": "Fiş tarihi bugünden ileri olamaz.",
  "error_40103": "Masraf projesi aktif durumda değildir.",
  "error_MN100001": "Teslimat Lideri Boş olamaz.",
  "error_MN100002": "Proje bitiş tarihi daha önce seçilmiş olan bitiş tarihinden önce ki bir tarih olamaz.",
  "error_MN100003": "Sadece taslak olarak kaydedilen projeler silinebilir.",
  "error_MN100004": "Proje pasif yapma tarihi ile aktif dönem aynı ay ve yıl içerisinde ise tekrar pasif durumdan aktif duruma geçebilir.",
  "error_MN100005": "Aktif olarak kaydedilen projenin Döviz Cinsi,Başlangıç Tarihi,Proje Tipi,WBS,Müşteri,Alt Şirket alanları değiştirilemez.",
  "error_MN100006": "LBA daha önce seçilmiş ise değiştirilemez.",
  "error_RL100001": "İlgili Rol Adı mevcut roller içerisinde tanımlıdır, lütfen kontrol ediniz.",
  "error_RL100002": "Rol değiştirilemez.",


  "error_RS011205": "Aynı kullanıcı adı ile birden fazla kaynak oluşturulamaz.",
  "error_RS011206": "Aynı kullanıcı maili ile birden fazla kaynak oluşturulamaz.",
  "error_CL011105": "Mevcutta bu KOD kullanılmaktadır, yeni bir KOD girişi yapınız!",
  "error_CL011106": "İlgili VKN Numarası daha önceden başka bir müşteri için kullanılmıştır, lütfen kontrol ediniz.",

  "error_30101": "Zaman çizelgesi açıklama alanı doldurulmalıdır.",

  "label_project_selection_is_mandatory_for_rate_selection":"Saat Ücreti girişi için  proje seçimi zorunludur.",
  "label_mark_all_read":"Tümünü Okundu İşaretle",
  "label_cap_active":"Cap Aktif",
  "label_first_cap_active":"Fatura kayıt olurken CAP kullanılmış.",
  "label_average_free_cap_amount":"Ortalama ücretsiz CAP Tutarı : ",
  "label_show_only_unread":"Yalnızca okunmayaları göster",
  "label_project_request":"Proje Talep",
  "label_number_of_list":"Listelenen Kayıt Sayısı",
  "label_empty_list":"Listelenecek veri bulunmamaktadır",
  "label_ok": "Tamam",
  "label_save": "Kaydet",
  "label_clear_form": "Formu Temizle",
  "label_user_delete": "Kullanıcı Sil",
  "label_active": "Aktif",
  "label_passive": "Pasif",
  "label_draft": "Taslak",
  "label_savechanges": "Değişiklikleri Kaydet",
  "label_close": "Vazgeç",
  "label_cancel": "İptal",
  "label_new": "Yeni",
  "label_required_field": "Bu alan zorunludur.",
  "label_wrong_email_format": "Girdiğiniz email adresi yanlış formattadır.",
  "label_missing_wbs": "Girdiğiniz wbs eksiktir.",
  "label_wrong_phone_format": "Girilen telefon formatı yanlıştır.",
  "label_email": "E-Mail",
  "label_confirm_password": "Şifreyi Tekrar Giriniz",
  "label_country": "Ülke",
  "label_city": "Şehir",
  "label_address": "Adres",
  "label_industry": "Sektör",
  "label_phone": "Telefon Numarası",
  "label_search": "Ara",
  "label_search_user": "Lütfen bir kullanıcı seçiniz",
  "label_forecast_search": "Tahmin Ara",
  "label_upload":"Yükle",
  "label_menu_tab1":"Tab 1",
  "label_menu_tab2":"Tab 2",
  "label_menu_tab3":"Tab 3",
  "label_leftmenu_menu_1":"Menü 1",
  "label_leftmenu_menu_2":"Menü 2",
  "label_leftmenu_menu_3":"Menü 3",
  "label_leftmenu_dashboard": "Ana Sayfa",
  "label_leftmenu_settings":"Ayarlar",
  "label_leftmenu_project":"Proje Talep",
  "label_leftmenu_all_project":"Tüm Projeler",
  "label_leftmenu_timesheet":"Zaman Çizelgesi",
  "label_leftmenu_timesheet_submission":"Zaman Çizelgesi Girişi",
  "label_leftmenu_notifications":"Bildirimler",
  "label_leftmenu_timesheet_wbs":"Timesheet Yönetimi",
  "label_leftmenu_timesheet_observe":"Gözlemleme",
  "label_leftmenu_timesheet_authorize_list":"Zaman Çizelgesi Düzenleme",
  "label_leftmenu_timesheet_settings":"Ayarlar",
  "label_leftmenu_client_management":"Müşteri Yönetimi",
  "label_leftmenu_authorization_management": "Yetki Yönetimi",
  "label_leftmenu_costrate_management": "Maliyet Oranları Yönetimi",
  "label_leftmenu_resource_management": "Kaynak Yönetimi",
  "label_leftmenu_employee_management": "Çalışan Yönetimi",
  "label_leftmenu_resource_cost_view_management": "Kaynak Maliyetleri",
  "label_leftmenu_project_management": "Proje Yönetimi",
  "label_leftmenu_invoice_management": "Fatura Yönetimi",
  "label_leftmenu_role_management": "Rol Yönetimi",
  "label_leftmenu_project_request":"Proje Talebi Oluştur",
  "label_leftmenu_pricing_create":"Fiyatlandırma Oluştur",
  "label_leftmenu_project_request_list":"Proje Talep Listesi",
  "label_leftmenu_pricing_list":"Fiyatlandırma Listesi",
  "label_leftmenu_invoice_ode": "Ode",
  "label_leftmenu_payment": "Muhasebe",
  "label_leftmenu_expense": "Masraf Girişi",
  "label_leftmenu_reports": "Raporlar",
  "label_leftmenu_finance": "Proje Finans",
  "label_leftmenu_left_expense": "Masraf",
  "label_leftmenu_expense_reports": "Proje Finans Masraf Raporu",
  "label_leftmenu_timesheet_reports": "Zaman Giriş Raporu",
  "label_leftmenu_invoice_reports": "Fatura Raporu",
  "label_leftmenu_graphic_reports": "Rapor Grafikleri",
  "label_leftmenu_rate_upload_export": "Saat Ücreti Excel İşlemleri",
  "label_leftmenu_timesheet_delay_reports": "Zaman Giriş Gecikme Raporu",
  "label_leftmenu_chargeability_reports": "Ücretlendirilebilirlik Raporu",
  "label_leftmenu_invoice_payment": "Fatura Ödeme Girişi",
  "label_leftmenu_payroll_reports": "Proje Finans Kaynak Raporu",
  "label_leftmenu_finance_reports": "Finans Raporu",
  "label_leftmenu_finance_project_detail_report": "Proje Bazlı Rapor Al",
  "label_leftmenu_finance_invoice_report": "Fatura Raporu Al",
  "label_leftmenu_finance_resource_report": "Kaynak Raporu Al",
  "label_leftmenu_finance_expense_report": "Masraf Raporu Al",
  "label_leftmenu_get_report": "Rapor Al",
  "label_leftmenu_forecasts": "Tahminleme",
  "label_leftmenu_pricing": "Fiyatlandırma",
  "label_leftmenu_forecast_table":"Tahmin Tablosu",
  "label_leftmenu_company_expense_entry": "Firma Masraf Girişi",
  "label_leftmenu_subcompanymanagement": "Alt Şirket Yönetimi",
  "label_leftmenu_systemwbs_management": "Sistem WBS Yönetimi",
  "label_leftmenu_pre_closure": "Dönem Kapanış",
  "label_leftmenu_forecast_approve": "Tahmin Onay",
  "label_navbar_search": "Arama yap...",
  "label_navbar_logout": "Çıkış",
  "label_navbar_logout_confirm": "Oturumu kapatmak istediğinizden emin misiniz?",
  "label_home_welcome": "DefineX Template uygulamasına hoşgeldiniz...",
  "label_choose_template": "Template Seçiniz",
  "label_authentication_login_captcha_verification": "Yukarıdaki değerleri giriniz..",
  "label_authentication_login": "Giriş Yap",
  "label_authentication_register": "Kaydol",
  "label_authentication_change_password":"Şifreyi Değiştir",
  "label_authentication_login_dont_have_account": "Bir hesabınız yok mu?",
  "label_authentication_login_forget_password": "Şifreni mi unuttun?",
  "label_authentication_register_company_name": "Şirket Adı",
  "label_authentication_register_company_email": "Şirket Mail Adresi",
  "label_authentication_register_company_address": "Şirket Adresi",
  "label_authentication_register_user_name": "Ad",
  "label_authentication_register_user_surname": "Soyad",
  "label_authentication_register_email": "E-Mail Adresiniz",
  "label_authentication_password_requirement": "Şifre Gereksinimleri",
  "label_authentication_password_requirement_description": "Şifreniz aşağıdaki gereksinimlere uygun olmalıdır",
  "label_authentication_password_requirement_at_least_eight_character": "En az 8 karakter",
  "label_authentication_password_requirement_at_least_max_fifteen_character":"En fazla 15 karakter",
  "label_authentication_password_requirement_at_least_one_special_character": "En az 1 özel karakter",
  "label_authentication_password_requirement_at_least_one_number": "En az 1 rakam",
  "label_authentication_password_requirement_at_least_one_capital_letter": "En az 1 büyük harf",
  "label_authentication_password_requirement_at_least_one_small_letter": "En az 1 küçük harf",
  "label_authentication_register_already_have_account": "Zaten bir hesabım var.",
  "label_authentication_register_sucess_message":"Teşekkür ederiz! \n\n Talebinizi aldık. \n\n E-posta adresinize gönderilen bağlantı üzerinden hesabınızı onaylayarak giriş yapabilirsiniz.",
  "label_authentication_forgot_sucess_message":"Teşekkür ederiz! \n\n Yenileme isteğiniz alındı. \n\n E-posta adresinize gönderilen bağlantıya tıklayarak şifrenizi belirleyebilirsiniz.",
  "label_authentication_register_complete_message":"Teşekkür ederiz!\n\n Aktivasyon başarı ile tamamlandı. \n\n Aşağıdaki butona tıklayarak giriş ekranına gidebilirsiniz. ",
  "label_authentication_forgot_complete_message":"Teşekkür ederiz!\n\n Şifre değiştirme başarı ile tamamlandı. \n\n Aşağıdaki butona tıklayarak giriş ekranına gidebilirsiniz.",
  "label_authentication_forgot_send":"Şifremi Gönder",
  "label_company_company_information": "Şirket Bilgileri",
  "label_company_company_information_contact": "İletişim için",
  "label_company_company_information_edit_title": "Şirket Bilgilerini Güncelle",
  "label_company_company_information_name": "Şirket Adı",
  "label_company_company_information_description": "Açıklama",
  "label_company_company_information_email": "Şirket E-maili",
  "label_company_company_information_address": "Adres",
  "label_company_company_information_contact_name": "İletişim Kişisi",
  "label_company_company_users": "Kullanıcılar",
  "label_company_company_users_new_user": "Yeni Kullanıcı",
  "label_company_user_email": "Kullanıcı Adı",
  "label_company_user_password": "Şifre",
  "label_company_user_name": "Ad",
  "label_company_user_surname": "Soyad",
  "label_roles": "Roller",
  "label_role": "Rol",
  "label_users": "Kullanıcılar",
  "label_role_not_found": "Role Bulunamadı",
  "label_user_not_found": "Kullanıcı Bulunamadı",
  "label_management": "Yönetim ",
  "label_management_add_new_user": "Yeni Kullanıcı",
  "label_management_users_new_user": "Yeni Kullanıcı",
  "label_management_users_new_record": "Yeni Kayıt",
  "label_management_users_new_invoice_record": "Yeni Fatura Kayıt",
  "label_management_users_edit_user": "Kullanıcı Düzenle",
  "label_management_users_new_role": "Yeni Rol",
  "label_management_permissions_desc": "Yetki Anahtar Tanımları",
  "label_management_permission_name": "Yetki Anahtarı",
  "label_management_permission_definition": "Tanım",
  "label_management_users_edit_role": "Rol Düzenle",
  "label_management_user_name": "Ad",
  "label_management_user_surname": "Soyad",
  "label_management_user_name_surname": "Ad Soyad",
  "label_management_user_username": "Kullanıcı Adı",
  "label_management_user_usertype": "Kullanıcı Tipi",
  "label_management_user_result": "Tüm Sonuçlar",
  "label_management_role_name": "Rol Adı",
  "label_management_role_description": "Rol Tanımı",
  "label_Name_Surname": "Ad Soyad",
  "label_UserName": "Kullanıcı Adı",
  "label_UserType": "Kullanıcı Tipi",
  "label_Statu": "Durum",
  "label_Accounting_Statu": "Muhasebe Durumu",
  "label_Actions": "Operasyonlar",
  "label_Verification_Link_notActive": "Tıklamış olduğunuz link geçerliliğini yitirmiştir.",
  "label_select_file":"Lütfen Dosya Seçin",
  "label_file_upload_success":"Dosya yükleme işlemi başarı ile tamamlandı.",
  "label_file_upload_list":"<strong>Dosya Listesi</strong><br/>",
  "label_management_scope": "Faaliyet Alanı",
  "label_detail":"Detay",
  "label_current_month":"Mevcut Ay",
  "label_quarter_to_date":"Çeyrekten Tarihe",
  "label_quarter":"Çeyrek",
  "label_year":"Yıl",
  "label_year_to_date":"Yıldan Bugüne",
  "label_annual_leave_balance":"Yıllık İzin Durumu",
  "label_annual_leave_balance_alert":"Çok yakında",
  "label_wbs_proje":"WBS-Proje",
  "label_summary": "Özet",

  "label_correspondence_search": "Ara",
  "label_clear": "Temizle",
  "label_remember_me": "Beni Hatırla!",
  "label_confirm":"Onayla",
  "label_choose":"Seçiniz",
  "label_data_no_found": "Veri bulunamadı.",
  "label_press_enter_add":"Enter tuşuna basıp ekleme yapabilirsiniz.",

  "label_client_management": "Müşteri Yönetimi",
  "label_client_management_table_code": "Müşteri Kodu",
  "label_subcompany_management_table_code": "Alt Şirket Kodu",
  "label_client_management_table_description": "Tanım",
  "label_client_management_table_group": "Müşteri Grubu",
  "label_client_management_table_name": "Müşteri",
  "label_client_management_name": "Müşteri Adı", 
  "label_client_management_table_short_name": "Müşteri Kısa Adı",
  "label_client_management_table_address": "Adres",
  "label_client_management_table_tax_number": "Vergi Numarası",
  "label_client_management_table_tax_department": "Vergi Dairesi",
  "label_client_management_table_sector": "Sektör",
  "label_client_management_table_subsector": "Alt Sektör",
  "label_client_management_table_financial_responsible": "Finans Sorumlusu Adı",
  "label_client_management_table_financial_mail": "Finans Sorumlusu E-Mail",
  "label_client_management_table_financial_phone": "Finans Sorumlusu Telefon",
  "label_client_management_table_project_mail": "Müşteri Sorumlu E-Mail",

  "label_user_management_user_info": "Kullanıcı Bilgileri",
  "label_user_management_privileges": "Yetkiler",
  "label_user_management_projects": "Projeler",
  "label_assigning_users_to_the_project": "Projeye Kullanıcı Atama",
  "label_project_user_role_assignment": "Proje Kullanıcı - Rol Atama",
  "label_user_project_roles": "Projeler - Roller",
  "label_user_management_wbs": "WBS",
  "label_user_management_search_with_name": "Kullanıcı ile Ara",
  "label_user_management_user_name": "Kullanıcı Adı",

  "label_resource_management_search_with_name": "Kullanıcı ile Ara",
  "label_resource_management_username": "Kullanıcı Adı",
  "label_resource_management_personal_info": "Kişi Bilgileri",
  "label_resource_management_financial_info": "Finansal Bilgiler",
  "label_resource_management_lcr": "LCR",
  "label_resource_management_lcr_detailed": "Brüt Saatlik Ücret",
  "label_resource_management_tbd": "TBD",
  "label_resource_management_chargeability": "Ücretlendirilme Oranı %",
  "label_resource_management_work_force": "İş Kolu",
  "label_resource_management_work_place": "Çalışma Kolu",
  "label_resource_management_location": "Lokasyon",
  "label_resource_management_career_track": "Kariyer Yolu",
  "label_resource_management_functional_area": "Fonksiyonel Alan",
  "label_resource_management_level": "Ünvan",
  "label_resource_management_manager": "Yönetici",
  "label_resource_management_job_end_date": "Çıkış Tarihi",
  "label_resource_management_load_factor": "Yük Çarpanı",
  "label_resource_management_is_fired": "Pasif",
  "label_resource_management_auto_hour": "Saatleri Otomatik Getir",
  "label_resource_management_hiring_date": "Giriş Tarihi",

  "label_table_column_actions":"Aksiyonlar",

  "label_project_management_project_info": "Proje Bilgileri",
  "label_project_management_client": "Müşteri",
  "label_project_management_project_name": "Proje Adı",
  "label_project_management_start_date": "Başlangıç Tarihi",
  "label_project_management_end_date": "Bitiş Tarihi",
  "label_project_management_cal": "Müşteri Yöneticisi",
  "label_project_management_forecast_approver": "Tahmin Onaylayan",
  "label_project_management_managers": "Proje Yöneticisi",
  "label_project_management_delivery_lead": "Teslimat Lideri",
  "label_project_management_dl_start_date": "TL Başlangıç Tarihi",
  "label_project_management_project_type": "Proje Tipi",
  "label_project_management_status": "Durum",
  "label_project_management_currency": "Döviz Cinsi",
  "label_project_management_lba": "LBA",
  "label_project_management_wbs": "WBS",
  "label_project_management_myt_open": "Myt Açık",
  "label_project_management_expense_open": "Expense Açık",
  "label_project_management_wbs_description": "WBS Açıklama",
  "label_project_management_tow": "İş Türü",
  "label_project_management_client_billing": "Faturalama Metodu",
  "label_project_management_service_type": "Hizmet türü",
  "label_project_management_type": "Proje Tipi",
  "label_project_management_cap": "Saat Sınır Bilgisi",
  "label_project_management_cap_rate": "Saat Sınır Oranı",
  "label_project_management_fee_ode": "Ciro",
  "label_project_management_free_cap": "Ücretsiz sınır aşımı oranı",
  "label_project_management_about_project": "Proje Hakkında",
  "label_project_management_payment_info": "Vade Bilgisi (Gün)",
  "label_project_management_assign_authority": "Yetki Atama",
  "label_project_management_pricing_engine":"Fiyatlandırma Kodu",
  "label_project_management_add_rate":"Saat Ücreti Ekle",
  "label_project_management_add_rate_area":"Saat Ücreti Ekleme Alanı",
  "label_project_management_rate_info":"Saat Ücreti",
  "label_project_management_rate_info_id":"Kullanıcı Adı",
  "label_project_management_rate_info_level":"Seviye",
  "label_project_defining_access_aut":"Proje Erişim Yetkisi Tanımlama",
  "label_project_management_observer":"Gözlemci",
  "label_project_management_rate_startdate": "Başlangıç Tarihi",
  "label_project_management_rate_enddate": "Bitiş Tarihi",
  "label_project_management_is_waitingforapproval_project":"Proje Açılış Talepleri",
  "label_project_management_active_project_wbs_alert":"Aktif olarak kaydedilen projeler için WBS değişikliği yapılamaz.",
  "label_invoice_cal_dont_use_timesheet_amount":"Hesaplanan Tutarı Kullanmamak",

  "label_invoice_management_period": "Dönem",
  "label_invoice_management_delayed_period": "Gecikmiş Dönem",
  "label_invoice_management_new_invoice": "Yeni Fatura Oluştur",
  "label_invoice_management_new_invoice_payment_date": "Ödeme Tarihi",
  "label_invoice_management_new_invoice_to_invoice": "Fatura Kime",
  "label_invoice_management_new_invoice_title": "Fatura Başlık",
  "label_invoice_management_po_number": "Po Numarası",
  "label_invoice_management_new_invoice_desc": "Açıklama",
  "label_invoice_management_new_invoice_draft": "Taslak",

  "label_invoice_calculate_management_unbilled_hour": "Fatura Edilmemiş Saatler",
  "label_invoice_calculate_management_total_unbilled_hour": "Toplam Fatura Edilmemiş Saatler",
  "label_invoice_claculate_management_specific_date": "Tarih Aralığına Göre Saatler",
  "label_invoice_claculate_management_unbilled_timesheet": "TimeSheet Faturalandırılamaz Saatler Gelsin",

  "label_report_task_detail": "Task Detay Bazlı Rapor",
  "label_report_month_detail": "Ay Bazlı Rapor",

  "label_payment_invoice_no": "Fatura No",
  "label_payment_invoice_date": "Fatura Tarihi",
  "label_payment_invoice_amount": "Tutar",
  "label_payment_invoice_kdv_amount": "KDV Tutar",
  "label_payment_invoice_amount_paid": "Ödenen Tutar",
  "label_payment_invoice__actual_payment_date": "Gerçekleşen Ödeme Tarihi",
  "label_payment_invoice_status": "Durum",
  "label_payment_invoice_type": "Fatura Tipi",
  "label_payment_invoice_prepayment": "İlişkili Ön Ödeme",
  "label_payment_invoice_to": "Fatura Kime",
  "label_payment_invoice_title": "Fatura Başlık",
  "label_payment_invoice_desc": "Açıklama",

  "label_invoice_management": "Fatura Yönetimi",
  "label_payment_invoice": "Fatura Ödeme Girişi",
  
  "label_project_management_table_request_no": "Talep No",
  "label_project_management_table_column_id": "Kullanıcı Adı",
  "label_project_management_table_column_project": "Proje Adı",
  "label_project_management_table_column_client": "Müşteri",
  "label_project_management_table_column_wbs": "WBS",
  "label_project_management_table_columns_statu": "Durum",
  "label_project_management_table_columns_project_type": "Proje Türü",
  "label_project_management_table_columns_start_date": "Başlangıç Tarihi",
  "label_project_management_table_columns_end_date": "Bitiş Tarihi",
  "label_project_management_table_columns_cal": "Müşteri Yöneticisi",
  "label_project_management_table_columns_forecast_approver": "Tahmin Onaylayan",
  "label_project_management_table_columns_currency": "Döviz Cinsi",
  "label_project_management_table_columns_managers": "Proje Yöneticisi",
  "label_project_management_table_columns_myt": "Myt Açık",
  "label_project_management_table_columns_expense": "Expense Açık",
  "label_project_management_table_columns_delivery_lead": "Teslimat Lideri",
  "label_project_management_table_columns_dl_date": "TL Başlangıç Tarihi",
  "label_project_management_table_columns_lba": "LBA",
  "label_project_management_table_columns_lba_time_period": "LBA Time Period",
  "label_project_management_table_columns_tow": "İş Tipi",
  "label_project_management_billing_client": "Faturalandırılacak Müşteri",

  "label_invoice_management_table_column_invoice_no": "Fatura No",
  "label_invoice_management_table_column_invoice_date": "Fatura Tarihi",
  "label_invoice_management_table_column_invoice_amount": "Tutar",
  "label_invoice_management_table_columns_tow": "İş Türü",
  "label_invoice_management_table_column_invoice_kdv_amount": "KDV'li Tutar",
  "label_invoice_management_table_column_invoice_wbs": "WBS",
  "label_invoice_management_table_column_invoice_kdv_rate": "KDV",
  "label_invoice_management_table_column_invoice_tevkifat": "Tevkifat",
  "label_invoice_management_table_column_invoice_stopaj": "Stopaj",
  "label_invoice_management_table_column_invoice_currency": "Döviz Kuru",
  "label_invoice_management_table_column_invoice_tl_currency": "TL Tutarı",
  "label_invoice_management_table_column_invoice_estimated_payment_date": "Beklenen Ödeme Tarihi",
  "label_invoice_management_table_column_invoice_proforma_date": "Proforma Tarihi",
  "label_invoice_management_table_column_invoice_actual_payment_date": "Gerçekleşen Ödeme Tarihi",
  "label_invoice_management_new_invoice_next_payment_date": "Sonr. Bekl. Ödeme Tar.",
  "label_invoice_management_table_column_invoice_status": "Durum",
  "label_invoice_management_table_column_invoice_type": "Fatura Tipi",
  "label_invoice_management_table_column_invoice_payment_id": "Bağlı Ödeme ID",
  "label_partial_payment" : "Kısmi Ödeme mi?",
  "label_currency_diff" : "Kur Farkı ",   
  "label_invoice_calc_save" : "Fatura Hesapla ve Kaydet",
  "label_invoice_billing_client": "Faturalandırılacak Müşteri",

  "label_forecast_approve_table_column_client_name": "Müşteri",
  "label_forecast_approve_table_column_project_name": "Proje",
  "label_forecast_approve_table_column_time_period": "Dönem",
  "label_forecast_approve_table_column_sender_name": "Gönderen Kullanıcı",
  "label_forecast_approve_table_column_wbs": "WBS",
  "label_forecast_approve_table_column_status": "Durum",
  "label_fa_approve": "Onayla",
  "label_fa_reject": "Reddet",
  "label_leftmenu_forecast_approve_management": "Tahmin Onay",
  "label_forecast_approve_status_waiting_approval":"Tahminininiz onaylanana kadar değişiklik yapamazsınız.",
  "label_forecast_approve_status_approved":"Onaylanmış tahminler üzerinde yeni dönem açılana kadar işlem yapılamaz.",
  "label_forecast_delete_confirm": "Silinen tahminler tekrar geri alınamaz. Bu tahmini silmek istediğinizden emin misiniz?",

  "label_virtual_wbs_table_column_id":"Id",
  "label_virtual_wbs_table_column_wbs":"WBS",
  "label_virtual_wbs_table_column_status":"Durum",
  "label_virtual_wbs_table_column_definition":"Tanım",
  "label_virtual_wbs_table_column_myt_open":"MyT Açık",
  "label_virtual_wbs_table_column_expense_open":"Expense Açık",

  "label_expense_table_column_form_no":"Form No",
  "label_expense_table_colmun_client_project": "Müşteri-Proje",
  "label_expense_table_column_form_wbs":"WBS",
  "label_expense_table_column_form_total_amount":"Toplam Tutar",
  "label_expense_table_column_form_approval_date":"Onaya gönderilen tarih",
  "label_expense_table_column_form_submitted_date":"Onaylanan/Reddedilen Tarih",
  "label_expense_table_column_form_status":"Durum",

  "label_expense_table_column_expense_no":"Masraf No",
  "label_expense_table_column_corporation":"Kurum",
  "label_expense_table_column_category":"Kategori",
  "label_expense_table_column_receiptdate":"Fiş Tarihi",
  "label_expense_table_column_amount":"Tutar",
  "label_expense_table_column_description":"Açıklama",


  "label_virtual_wbs":"Sanal WBS",
   

  "label_ode_year": "ODE Yılı",
  "label_ode_billing": "Billing",
  "label_ode_collection": "Collection",
  "label_ode_chargeable_expense": "Chargeable Expense",
  "label_ode_revenue": "Revenue",
  "label_ode_payroll": "Payroll",
  "label_ode_expense": "Expense",
  "label_ode_other": "Other",
  "label_ode_solution_cont": "Solution Cont",
  "label_ode_capital_charge": "Capital Charge",
  "label_ode_cci_percent": "CCI %",
  "label_ode_cci": "CCI",
  "ode_year_validation": "ODE dönemi bilgisini giriniz.",
  "ode_year_selected": "ODE yılı bilgisini seçiniz.",

  "label_button_project_management_project_save":"Proje Kaydet",
  "label_button_project_management_project_delete":"Proje Sil",
  "label_button_project_management_project_new_virtual_wbs":"Yeni Sanal WBS",
  "label_button_project_management_project_clear_form":"Formu Temizle",
  "label_button_payment_invoice_save":"Kaydet",
  "label_button_project_request":"Talep Oluştur",
  "label_button_pricing_forecast":"Fiyatlandırma Tahmini",
  "label_button_project_management_project_create":"Proje Oluştur",

  "label_button_invoice_management_fetch_invoice_pending_payment":"Ödeme Bekleyen Faturaları Getir",
  "label_button_ode_save":"Kaydet",
  "label_button_rate_save":"Kaydet",
  "label_button_timesheet_calculate":"Hesapla",
  "label_button_timesheet_addrow":"Satır Ekle",

  "label_button_update_currency":"Kur Güncelleme",
  "label_button_pre_closure":"Ön Kapanış",
  "label_button_term_closure":"Dönem Kapanış",
  "label_modeules":"Modüller",
  "label_modeules_timesheet":"Timesheet",
  "label_modeules_expense":"Masraf",
  "label_modeules_finance":"Finans",
  "label_modeules_timesheet_closed":"Zaman çizelgesi modülü şuan için aktif değildir.",
  "label_modeules_expense_closed":"Masraf modülü şuan için aktif değildir.",
  "label_modeules_finance_closed":"Proje Finans  modülü şuan için aktif değildir.",
  "label_modeules_report_required_closed":"Lütfen işlem yapmak istediğiniz “Tarih” için seçim yapınız.",
  "label_modeules_report_required__period_closed":"Lütfen işlem yapmak istediğiniz “Dönem” ve “Proje” için seçim yapınız.",
  "label_expense_form_list":"Masraf Form Listesi",
  "label_expense_client": "Müşteri",
  "label_expense_project": "Proje",
  "label_expense_expense_date": "Masraf Tarihi",
  "label_expense_amount": "Tutar",
  "label_expense_currency": "Döviz Cinsi",
  "label_expense_kdv": "KDV",
  "label_expense_expense_type": "Masraf Türü",
  "label_expense_period": "İşlendiği Period",
  "label_expense_expense_owner": "Masraf Sahibi",
  "label_expense_isinvoiceable": "Müşteriye Fatura",
  "label_expense_bring_expenses": "İşlenmemiş Faturaları Getir",
  "label_expense_isinvoiceablecustomer": "Müşteriye Faturalanacak",
  "label_expense_report_pdf": "Masraf Çıktısı Al",
  "label_expense_isprocessed": "İşlendi",
  "label_expense_not_isprocessed": "İşlenmedi",
  "expense_date_cant_bebigger": "Masraf tarihi bugünden büyük olamaz.",
  "expense_kdv_required": "Masraf tipi Damga vergisi veya Tax token değerine eşit değil ise kdv alanını seçmek zorunludur.",
  "label_expense_confirm": "Formu onaya göndermek istediğinizi kabul ediyor musunuz? Gönderim yapıldıktan sonra form üzerinde herhangi bir değişiklik yapılamaz.",
  "label_confirm_charged_expenses": "Onaylar",
  "label_expense_status_reject": "Reddedildi",
  "label_expense_status_sentforapproval": "Onaya Gönderildi",
  "label_expense_status_approved": "Onaylandı",
  "label_expense_status_draft": "Taslak",
  "label_confirm_expense_form_dialog_header": "Masraf Onaylama/Reddetme",
  "label_expense_dialog_header": "Masraf Kalemleri",
  "label_expense_client_project": "Müşteri-Proje-WBS",
  "label_expense_reject_description": "Ret Açıklaması",
  "label_expense_approve_description": "Onay Açıklaması",
  "label_expense_send_approvement_period": "Onaya Gönderilen Tarih",
  "label_expense_financial_all_expenses": "Tüm Masraf Formları",
  "label_expense_pen_financial_all_expenses": "Tüm Masraf Kalemleri",
  "label_expense_<_my_expenses": "< Masraflarım",
  "label_expense_table_category": "Kategori",
  "label_expense_table_user": "Kişi",
  "label_expense_table_project_wbs": "Müşteri-Proje-WBS",
  "label_expense_table_subcompany": "Alt Şirket",
  "label_expense_table_statu": "Durum",
  "label_expense_table_send_to_approve_date": "Gönderilen Tarih",
  "label_expense_table_approvement_date": "Cevap Tarihi",
  "label_expense_table_date": "Tarih",
  "label_expense_table_amount": "Tutar",
  "label_expense_table_amountwitvat": "KDV'li Tutar",
  "label_expense_table_project_manager": "Proje Müdürü",
  "label_expense_form_detail": "Form Detay",
  "label_expense_form_update": "Form Güncelleme",
  "label_expense_receipt_date_cant_smaller_now": "Fiş tarihi kapanan yıl içerisinden seçilemez.",

  "label_expense_finance_search_expense_formno": "Form No",
  "label_expense_finance_search_expense_no": "Masraf No",
  "label_expense_finance_search_user": "Kişi",
  "label_expense_finance_search_category": "Kategori",
  "label_expense_finance_search_wbs": "WBS",
  "label_expense_finance_search_client_project": "Müşteri-Proje",
  "label_expense_finance_search_subcompany": "Alt Şirket ",
  "label_expense_finance_search_statu": "Durum",
  "label_expense_finance_search_date": "Tarih",
  "label_expense_finance_expense_date": "Masraf Tarihi",
  "label_expense_filter": "Filtreleme",
  "label_approve_selected": "Seçili Olanları Onayla",

  "label_expense_user": "Kullanıcı Adı",

  "label_home_project_selection": "Projet Seçimi",
  "label_home_project_selection_pasif_project":"Pasif Projeleri Göster",

  "label_expense_report_start_period":"Başlangıç Dönemi",
  "label_expense_report_end_period":"Bitiş Dönemi",
  "label_expense_report_bring":"Getir",
  "label_expense_report_choose_project":"Proje Seç",
  "label_expense_report_back":"Geri",
  "label_expense_report_all":"Tümü",
  "label_expense_report_project_confirm":"Proje Seçimini Onayla",
  "label_expense_report_client_group":"Müşteri Grubu",
  "label_expense_report_project_type":"Proje Tipi",
  "label_expense_report_expense_group":"Masraf Grup",
  "label_expense_report_date":"Tarih",
  "label_expense_report_vat_rate":"KDV Oranı",
  "label_expense_report_expense_period":"Masraf Dönemi",
  "label_expense_report_expense_operate_period":"Masraf İşlenme Dönemi",
  "label_expense_report_wbs":"WBS",
  "label_expense_report_msaraf_id":"Masraf Id",
  "label_expense_report_description":"Açıklama",
  "label_expense_report_expense_type":"Masraf Tipi",
  "label_expense_report_client":"Müşteri",
  "label_expense_report_project":"Proje",
  "label_expense_report_expense_owner":"Masraf Sahibi",
  "label_expense_report_amount":"Tutar",
  "label_expense_report_currrency":"Döviz Cinsi",
  "label_expense_report_download":"Rapor İndir",

  "label_invoice_report_start_period":"Başlangıç Dönemi",
  "label_invoice_report_end_period":"Bitiş Dönemi",
  "label_invoice_report_bring":"Getir",
  "label_invoice_report_choose_project":"Proje Seç",
  "label_invoice_report_project_confirm":"Proje Seçimini Onayla",
  "label_invoice_report_project":"Proje",
  "label_invoice_report_invoice_no":"Fatura No",
  "label_invoice_report_amount":"Tutar",
  "label_invoice_report_amount_with_vat":"KDV'li Tutar",
  "label_invoice_report_currency":"Döviz Cinsi",
  "label_invoice_report_currency_rate":"Döviz Cinsi Oranı",
  "label_invoice_report_vat_rate":"KDV Oranı",
  "label_invoice_report_date":"Fatura Tarihi",
  "label_invoice_predictable_payment_date":"Tahmini Ödeme Tarihi",
  "label_invoice_report_status":"Durum",
  "label_invoice_report_payment_date":"Ödeme Tarihi",
  "label_invoice_report_isprocessed":"İşlendi Mi",
  "label_invoice_report_operate_date":"İşlenme Tarihi",
  "label_invoice_report_invoice_period":"Fatura Dönemi",
  "label_invoice_report_wbs":"WBS",
  "label_invoice_report_waiting_paid":"Ödeme Bekliyor",
  "label_invoice_report_paid":"Ödendi",
  "label_invoice_report_canceled":"İptal Edildi",
  "label_invoice_report_draft":"Taslak",
  "label_invoice_report_waiting_invoice":"Faturalama Bekliyor",
  "label_invoice_report_billing": "Kesilen Fatura",
  "label_invoice_report_collection": "Tahsilat",

  "label_payroll_report_start_period":"Başlangıç Dönemi",
  "label_payroll_report_end_period":"Bitiş Dönemi",
  "label_payroll_report_bring":"Getir",
  "label_payroll_report_choose_project":"Proje Seç",
  "label_payroll_report_project_confirm":"Proje Seçimini Onayla",
  "label_payroll_report_resource":"Kullanıcı Adı",
  "label_payroll_report_reference_resource":"Referans ID",
  "label_payroll_report_tbd":"TBD",
  "label_payroll_report_period":"Dönem",
  "label_payroll_report_billable":"Faturalandırılma Durumu",
  "label_payroll_report_working_hour":"Çalışma Saati",
  "label_payroll_report_lcr":"LCR",
  "label_payroll_report_cost":"Maliyet",
  "label_payroll_report_wbs":"WBS",
  "label_payroll_report_project":"Proje",
  "label_payroll_report_is_happened":"Gerçekleşti Mi",
  "label_payroll_report_location":"Lokasyon",
  "label_payroll_report_career_path":"Kariyer Yolu",
  "label_payroll_report_practice_area":"Pratik Alanı",
  "label_payroll_report_level":"Level",
  "label_payroll_report_project_type":"Proje Tipi",
  "label_payroll_report_client":"Müşteri",
  "label_payroll_report_client_group":"Müşteri Grubu",

  "label_expense_cost_date":"Tarih",
  "label_expense_type":"Masraf Tipi",
  "label_expense_group":"Masraf Grubu",
  "label_expense_owner":"Masraf Sahibi",
  "label_expense_amount_report":"Masraf Tutarı",
  "label_expense_original_amount":"Orjinal Tutar",
  "label_expense_description":"Açıklama",

  "label_form_forecast_resource_add_title":"Kaynak Ekle",
  "label_forecast_resource_add_name":"ID",
  "label_forecast_resource_add_istbd":"TBD",
  "label_forecast_resource_add_rolename":"Rol",
  "label_forecast_resource_add_lcr":"LCR (Saatlik)",
  "label_forecast_resource_add":"Kaynak Ekle",
  
  "label_forecast_resource_id":"ID",
  "label_forecast_resource":"Kullanıcı Adı",
  "label_forecast_resource_sum":"Toplam",
  "label_forecast_resource_eac_cost":"EAC",
  "label_forecast_resource_etc_cost":"ETC",
  "label_forecast_resource_actual_cost":"Gerçekleşen",

  "label_forecast_cost_rate":"Maliyet Oranları",
  "label_forecast_costs":"Maliyetler",
  "label_forecast_added_resource":"Kaynak Ekle",
  "label_forecast_create_new":"Yeni Oluştur",
  "label_forecast_copy":"Kopyala",
  "label_forecast_update":"Güncelle",
  "label_forecast_delete":"Sil",
  "label_forecast_resorce_management":"Kaynak Yöntemi",
  "label_forecast_delivery_lead":"Teslimat Lideri",
  "label_forecast_approval":"Onaya Gönder",
  "label_forecast_currency":"Döviz Cinsi",
  "label_forecast_ode_period":"ODE Dönem",
  "label_forecast_choose_forecast":"Tahminleme Seç",
  "label_forecast_category":"Kategori",
  "label_forecast_actual":"Gerçekleşen",
  "label_forecast_etc":"BP (Bitirmek için Planlanan)",
  "label_forecast_eac":"BÖ (Bitiş Öngörüsü)",
  "label_forecast_ode":"OP (Orjinal Plan)",
  "label_forecast_delta":"Fark",
  "label_forecast_jan":"Oca",
  "label_forecast_feb":"Şub",
  "label_forecast_mar":"Mar",
  "label_forecast_apr":"Nis",
  "label_forecast_may":"May",
  "label_forecast_jun":"Haz",
  "label_forecast_jul":"Tem",
  "label_forecast_aug":"Ağu",
  "label_forecast_sep":"Eyl",
  "label_forecast_oct":"Eki",
  "label_forecast_nov":"Kas",
  "label_forecast_dec":"Ara",
  "label_forecast_client_project":"Müşteri-Proje",
  "label_forecast_text": "Tahmin",
  "label_detailed_forecast_search": "Tahmin Filtreleme",
  "label_forecast_active_projects": "Aktif Projeler",
  "label_forecast_passive_projects": "Pasif Projeler",
  "label_forecast_choose_to_see": "Tahminlemeyi görüntüleyebilmek için bir projeye ait tahminleme seçmelisiniz!",
  "label_button_forecat_send_approve": "Onaya Gönder",
  "label_forecasttable_revenues":"Gelir",
  "label_forecasttable_billings":"Faturalama",
  "label_forecasttable_collections":"Tahsilat",
  "label_forecasttable_chargeableexpenses":"Müşteriye Faturalandırılan Giderler",
  "label_forecasttable_totalcost":"Toplam Giderler",
  "label_forecasttable_payroll":"Çalışan Maliyetler",
  "label_forecasttable_expense":"Fiyata Dahil Giderler",
  "label_forecasttable_other":"Diğer",
  "label_forecasttable_solutioncont":"Proje Risk Yedeği",
  "label_forecasttable_capitalcharge":"Finansman Gideri",
  "label_forecasttable_cci":"Proje Kârı",
  "label_forecasttable_ccipercent":"Proje Kârlılığı %",

  "label_subcompany_maagement": "Alt Şirket Yönetimi",
  "label_subcompany_name": "Alt Şirket Adı",
  "label_subcompany_table_name": "Alt Şirket Adı",

  "label_project_request_info": "Proje Talep Bilgileri",
  "label_project_request_list": "Proje Açılış Talepleri",
  "label_project_request_client": "Müşteri",
  "label_project_request_proje": "Proje Adı",
  "label_project_request_is_new_client":"Yeni Müşteri",
  "label_project_request_new_customer_name":"Müşteri",

  "label_project_creation": "Proje Oluşturma",

  "label_project_permission_list":"Yetkiler",

  "label_document_id":"Kullanıcı Adı",
  "label_uploaded_document":"Kaydedilen Dökümanlar",
  "label_document_name":"Dosya Adı",
  "label_document_type":"Dosya Tipi",
  "label_document_description":"Açıklama",
  "label_document_upload":"Dosya Yükleme",

  "label_rate_info":"Saat Ücreti Bilgileri",
  "label_rate_info_id":"Kullanıcı Adı",
  "label_rate_info_level":"Seviye",

  "label_wbs_list":"WBS Listesi",
  "label_document_list":"Dosya Yükleme Alanı",

  "label_button_save_changes":"Değişiklikleri Kaydet",
  "label_forecast_alert":"Lütfen “Tahmin Seçiniz” alanı içerisinden işlem yapmak istediğiniz tahmini şeçiniz.",
  "label_forecast_create_alert":"Lütfen Tahmin Oluşturun",
  "label_forecast_resource_alert":"Kaynak Listesi Boş. Lütfen Kaynak Girişi Yapınız.",

  "label_form_update_forecat_title":"Tahmin Güncelle",
  "label_button_update_forecat":"Güncelle",
  "label_form_create_forecat_title":"Tahmin Oluşturma",
  "label_button_create_forecat":"Oluştur",
  "label_forecat_form_name":"Tahmin Adı",
  "label_forecat_form_description":"Açıklama",
  "label_forecat_form_start_date":"Başlangıç Tarihi",
  "label_forecat_form_end_date":"Bitiş Tarihi",
  "label_forecat_form_is_clone_to_master":"Master Forecast'den Kopyala",
  "label_forecat_form_manual_collection":"Manual Collection",
  "label_forecat_form_collection_ofset":"Collection Ofset",
  "label_form_send_approve_forecast_title":"Onaya Gönder",
  "label_forecast_form_approve_sender_message_title":"Gönderici Açıklaması",
  "label_forecast_form_fc_approver_message_title":"FC Onay Açıklaması",
  "label_forecast_form_approver_message_title":"Onay Açıklaması",

  "label_expense_create_form":"Form Oluştur",
  "label_expense_wbs":"WBS",
  "label_expense_form_no":"Form No",
  "label_expense_form_description":"Açıklama",
  "label_expense_categori":"Kategori",
  "label_expense_kdv_rate":"KDV Oranı",
  "label_expense_amount_with_kdv":"KDV'siz Tutar",
  "label_expense_date":"Masraf Tarihi",
  "label_expense_corporation":"Kurum",
  "label_expense_receipt":"Fiş Tarihi",

  "label_invoice_amount_with_kdv":"Toplam Tutar",


  "label_ode_info":"Plan Bilgileri",
  "label_new_role": "Rol tanımlama",
  "label_user_management_user_role_info": "Kullanıcı Rol Bilgileri",
  "label_project_other_authorizations":"Proje Bazlı Diğer Yetkiler",
  "label_project_management_client_project_wbs_name": "Müşteri-Proje-WBS",
  "label_project_other_authorizations_add":"Proje Bazlı Diğer Yetkiler Ekle",
  "label_cost_permission_management": "Masraf Yetki Yönetimi",
  "label_cost_permission_description": "Masraf Giriş İçin WBS Tanımlama",
  "operation_failed_rate": "İşleminiz tamamlanamadı.Seçili tarihlerde aynı {val} ile kayıt bulunmaktadır.",
  "label_searched_not_found": "Sonuç bulunamadı.",
  "label_send_reminder": "Hatırlatma Gönder",

  "label_timesheet_wbs_management": "Timesheet WBS Yönetimi",
  "label_timesheet_observer": "Gözlemciler",
  "label_timesheet_observing": "Gözlenenler",
  "label_timesheet_observer_authorizes_users": "Kullanıcı Adı",
  "label_timesheet_observer_user": "Kullanıcı Adı",
  "label_timesheet_observing_periods": "Dönem",
  "label_timesheet_observing_show": "Getir",
  "label_timesheet_status_draft": "Taslak",
  "label_timesheet_delete_confirm": "Zaman girişini silmek istiyor musunuz?",
  "label_timesheet_draft_save": "Taslak Kaydet",
  "timesheet_daily_limit_error": "Girmiş olduğunuz saat belirlenmiş aralık içerisinde değildir. ",
  "timesheet_wbs_not_selected_error": "Girmiş olduğunuz saat için bir adet wbs seçiniz.",
  "timesheet_at_least_one_day": "Minimum bir adet gün girişi yapmalısınız.",
  "timesheet_at_least_one_day_for_save": "Doldurulmuş gün bulunmamaktadır. Kayıt için bütün günler girilmelidir.",
  "timesheet_holiday_limit": "Tatil günlerine yanlış saat girişi yaptınız, lütfen kontrol ediniz.",
  "timesheet_found_dublicate_row": "Bir WBS birden fazla satırda bulunamaz.",
  "timesheet_found_disabled_row": "Pasife alınmış WBS kullanılamaz. Lütfen kontrol ediniz.",
  "timesheet_holiday_wbs_error": "Tipi tatil olan wbs ile eşleşmeyen tatil zamanı girişi bulunmaktadır.",
  "label_timesheet_description_character_limit": "* Açıklama için belirlenen limit 2000 karakterdir. Limit aşımı durumun da ilk 2000 karakter işlem görür.",
  "label_timesheet_full_holiday_description": "* Tam Tatil Günü: Tatil için varolan WBS için “tam gün” saati/dakikası girilmelidir. ",
  "label_timesheet_half_holiday_description": "* Yarım Tatil Günü: Tatil için varolan WBS için minimum “yarım gün” saati/dakikası girilmelidir.  ",
  "label_timesheet_assign_authority": "Yetki Atama",

  "label_wbs":"WBS",
  "label_wbs_owner":"WBS Sahibi",
  "label_wbs_type":"WBS Tipi",
  "label_wbs_state":"Durum",
  "label_wbs_description":"Açıklama",
  "label_wbs_chargeable": "Ücretli mi?",
  "label_wbs_permission": "İzin gerekli mi?",
  "label_wbs_expense": "Masraf girilebilir mi?",
  "label_wbs_time": "Zaman girilebilir mi?",
  "label_wbs_active": "Aktif mi?",
  "label_wbs_error": "Aynı WBS birden fazla tanımlanamaz.",
  "operation_no_project": "Mevcut sistem içerisinde tanımlı proje bulunmamaktadır.",
  "label_proforma" : "Proforma",
  "label_proforma_create" : "Proforma Oluştur",
  "label_proforma_update" : "Proforma Güncelle",
  "label_proforma_cancel" : "Proforma İptal",
  "label_proforma_date" : "Proforma Tarihi",
  "label_send_to_billing": "Faturalamaya Gönder",
  "label_project_not_active": "Proje Aktif değil.",
  "label_project_no_lba": "NOLBA - Sözleşme onayı alınmamış.",

  "operation_failed_invoice_1": "Proje Aktif değil.",
  "operation_failed_invoice_2": "Kapanmış Dönem faturalarına işlem yapılamaz.",
  "operation_failed_invoice_3": "Aktif time perioddan sadece bir dönem sonraki tarih için seçim yapılabilir.",
  "operation_failed_invoice_4": "Fatura tarihi ödeme tarihinden büyük olamaz.",
  "operation_failed_invoice_5": "İlişkili ön ödeme seçilmelidir.",
  "operation_failed_invoice_7": "Fatura para birimi {val} olmalıdır.",
  "operation_failed_invoice_6": "Değişiklik yapılamaz.Taslak,Proforma Onay Bekliyor durumunda ki faturalarda değişiklik yapılabilir.",
  "operation_failed_invoice_update": "Hata! Sadece taslak durumundaki faturalar silinebilir.",
  "operation_failed_invoice_amount": "Tutar alanı sıfırdan büyük olmalıdır",
  "operation_failed_invoice_draft": "Fatura durumu taslak.Değişiklik yapilamaz.",
  "operation_failed_invoice_proforma": "Fatura durumu proforma onay bekliyor.Değişiklik yapilamaz.",
  "operation_failed_invoice_cancel": "Fatura durumu iptal edilmiş.Değişiklik yapilamaz.",
  "operation_failed_currency_different": "Fatura para birimi ile proje para birimi farklıdır. Döviz kurunu güncel kur ile güncelleyiniz.",
  "operation_failed_invoice_next_payment_date": "Sonraki Ödeme Tarihi bulunduğumuz tarihten eski bir tarih seçilemez.",
  "operation_failed_invoice_date_next_payment_date": "Sonraki Ödeme Tarihi fatura tarihten eski bir tarih seçilemez.",
  "operation_failed_invoice_partial_payment": "Kısmi ödeme seçilmelidir.",
  "operation_failed_payment_date_now": "Ödeme tarihi bugünün tarihinden büyük olamaz.",
  "operation_failed_invoice_project_date": "Hata! Proje başlangıç tarihinin öncesine fatura kesilemez.",

  "operation_failed_resource_management_TotalActualCost": "Kapanmış aya ait saat girişi olan bir kaynak silinemez.",
  "operation_failed_forecast_resource_add": "Hata! Aynı kaynaktan birden fazla ekleme yapılamaz.",

  "label_invoicePaymentType_code_1": "Fatura",
  "label_invoicePaymentType_code_2": "Ön Ödeme",
  "label_invoicePaymentType_code_3": "Ön Ödemeye İstinaden",
  "label_invoicePaymentType_code_4": "Kur Farkı",
  "label_invoiceStatusType_code_1": "Faturalama Bekliyor",
  "label_invoiceStatusType_code_2": "Ödeme Bekliyor",
  "label_invoiceStatusType_code_3": "Ödendi",
  "label_invoiceStatusType_code_4": "İptal Edildi",
  "label_invoiceStatusType_code_5": "Taslak",
  "label_invoiceStatusType_code_6": "Proforma Onay Bekliyor",  
  "label_invoiceStatusType_code_7": "Proforma Oluşturuldu",
  "label_invoiceStatusType_code_8": "Fatura Geri Gönderildi",
  "label_invoiceStatusType_code_9": "Proforma Geri Gönderildi",
  "label_leftmenu_finance_invoice_management": "Tüm Faturalar",
  "label_leftmenu_finance_overdue_invoice_management": "Vadesi Geçmiş Faturalar",

  "label_expenseAccountingStatusType_code_1": "Ödendi",
  "label_expenseAccountingStatusType_code_2": "Tamamlandı",
  
  "label_pre_closure":"Ön Kapanış",
  "label_term_closure":"Dönem Kapanış",
  "label_pre_closure_currency_value":"Kur Bilgisi",
  "label_pre_closure_currency_value_update":"Kur Bilgisi Güncelle",
  "label_pre_closure_term_report":"Dönem Raporları",
  "label_term":"Dönem",
  "label_pre_closure_forecast_list":"Tahmin Listesi",
  "label_pre_closure_customer":"Müşteri",
  "label_pre_closure_project":"Proje",
  "label_pre_closure_forecast_status":"Tahmin Durumu",
  "label_pre_closure_forecast_last_update_date":"Tahmin Son Güncelleme Tarihi",
  "label_pre_closure_forecast_end_date":" Tahmin Bitiş Tarihi",
  "label_pre_closure_total_number_of_timesheet":"Toplam Zaman Çizelgesi Sayısı",
  "label_pre_closure_total_number_of_posted_timesheet":"Gönderilmiş Zaman Çizelgesi Sayısı",
  "label_pre_closure_total_number_of_posted_timesheet_short":"Gönderilmiş",
  "label_pre_closure_total_number_of_missing_timesheet":"Eksik Zaman Çizelgesi Sayısı",
  "label_pre_closure_missing_incorrect_timesheet":"Eksik/Hatalı Zaman Çizelgesi Listesi",
  "label_pre_closure_not_send_timesheet":"Gönderilmemiş Zaman Çizelgesi Sayısı",
  "label_pre_closure_not_send_timesheet_short":"Gönderilmemiş",
  "label_pre_closure_passive_project":"Pasif Proje",
  "label_pre_closure_total_number_of_cost_form":"Toplam Masraf Form Sayısı",
  "label_pre_closure_number_of_approved_expense_form":"Onaylanan Masraf Form Sayısı",
  "label_pre_closure_number_of_approved_expense_form_short":"Onaylanan",
  "label_pre_closure_number_of_expense_forms_awaiting_approval":"Onay Bekleyen Masraf Form Sayısı",
  "label_pre_closure_number_of_rejected_change_forms":"Reddedilen Masraf Form Sayısı",
  "label_pre_closure_cost_forms_monthly_total_amount":"Masraf Formları Aylık Toplam Tutar (TL)",
  "label_pre_closure_number_of_expenses_pending_approval_cost":"Onay Bekleyen Masraf Form Sayısı",
  "label_pre_closure_number_of_expenses_pending_approval_cost_short":"Onay Bekleyen",

  "label_timesheet_detail":"Timesheet Detay",
  "label_expense_detail":"Masraf Detay",
  "label_expenses_pending_approval":"Onay Bekleyen Masraflar Listesi",
  "label_timesheet_summary":"Zaman Girişi Özet",
  "label_expense_summary":"Masraf Özet",
  "label_expense_approver":"Masraf Onaycısı",
  "label_please_select_date_receipt":"Masraf kalemi tarihi, masraf formunun yaratıldığı dönemden ileri bir tarih için seçilemez.",

  "label_invoice_calculation_projectname":"Proje",
  "label_invoice_calculation_id":"ID",
  "label_invoice_calculation_date":"Tarih",
  "label_invoice_calculation_time_submission":"Ödenebilecek Zaman",
  "label_invoice_calculation_billed":"Faturalandırılan",
  "label_invoice_calculation_notbilled":"Faturalandırılmayan",
  "label_invoice_calculation_billed_timesheet":"Faturalandırılabilir",
  "label_invoice_calculation_notbilled_timesheet":"Faturalandırılamaz",
  
  "label_invoice_calculation_description":"Açıklama",
  "label_invoice_calculation_level":"Ünvan",
  "label_invoice_calculation_rate":"Saat Ücreti",
  "label_invoice_calculation_billing_amount":"Fatura Bedeli",

  "label_invoice_calculation_user":"Kullanıcı",
  "label_invoice_calculation_desc":"Açıklama",

  "label_file":"Dosya",
  "label_DONE": "Tamam",
  "label_project_based_roles": "Proje Bazlı Roller",

  "label_info_dialog_test_title": "Test Başlık",
  "label_info_dialog_test_desc": "Lorem ipsum dolor sit amet, consectetur adipiscing elit, sed do eiusmod tempor incididunt ut labore et dolore magna aliqua. Ut enim ad minim veniam, quis nostrud exercitation ullamco laboris nisi ut aliquip ex ea commodo consequat.",
  "label_invoice_detail": "Fatura Detayı",
  "label_calculated_invoice": "Hesaplanan Fatura",
  "label_time_list": "Zaman Listesi",

  "label_rate_download": "Saat Ücreti Bilgileri İndir",
  "label_rate_upload": "Saat Ücreti Bilgileri Yükle",

  "label_resource_download": "Tüm Verileri İndir",
  "label_resource_upload": "Kaynak Verisi Güncelleme",
  
  "label_bankaccountno": "Banka Hesap Numarası",

  "label_password_settings": "Şifre Ayarları",
  "label_daily_hour_settings": "Günlük Zaman Sınırı Ayarları",
  "label_calendar_settings": "Takvim Tatil Ayarları",

  "label_password_change_completed": "Şifre değiştirme işlemi başarı ile tamamlandı.",
  "label_password_change_not_completed": "Şifre değiştirme işlemi tamamlanamadı. Lütfen daha sonra tekrar deneyiniz.",

  "label_add_holiday_date": "Tatil Tarihi Ekle",
  "label_holiday_date": "Tatil Tarihi",
  "label_holiday_type": "Tatil Tipi",
  "label_holiday_duration": "Tatil Süresi",
  "label_holiday_isoptional": "İsteğe Bağlı",

  "label_daily_base_limit": "Günlük Dakika Alt Sınır",
  "label_daily_top_limit": "Günlük Dakika Üst Sınır",

  "label_last_viewed_projects": "Son Görüntülenen Projeler",
  "label_last_viewed_invoices": "Son Görüntülenen Faturalar",

  "label_forecast_approvement_status_WaitingForApprove": "Onay Bekliyor",
  "label_forecast_approvement_status_Approved": "Onaylandı",
  "label_forecast_approvement_status_Declined": "Reddedildi",
  "label_forecast_approvement_status_FCWaitingForApprove": "FC Onay Bekliyor",
  "label_forecast_approvement_status_FCDeclined": "FC Reddedildi",
  "label_forecast_approvement_status_NotSend": "Gönderilmedi",

  "label_pricing_create": "Fiyatlandırma Oluştur",
  "label_pricing_update": "Fiyatlandırma Düzenle",
  "label_pricing_permission": "İzinler",
  "label_pricing_permission_view": "Görüntüleme",
  "label_pricing_permission_edit": "Görüntüleme & Düzenleme",
  "label_pricing_user": "Kullanıcı Adı",

  "label_operation_preClosureStatus_1": "Ön kapanış işlemi eklendi.",
  "label_operation_preClosureStatus_2": "Ön kapanış işlemi başladı.",
  "label_operation_preClosureStatus_3": "Ön kapanış işlemi başarılı.",
  "label_operation_preClosureStatus_4": "Ön kapanış işleminde hata oluştu.",

  "label_operation_termClosureStatus_1": "Dönem kapanış işlemi eklendi.",
  "label_operation_termClosureStatus_2": "Dönem kapanış işlemi başladı.",
  "label_operation_termClosureStatus_3": "Dönem kapanış işlemi başarılı.",
  "label_operation_termClosureStatus_4": "Dönem kapanış işleminde hata oluştu.",

  "label_success_pre_closure": "Başarılı ön kapanış işlemi bekleniyor.",

  "preClosure_dialog": "Ön kapanış işlemini onaylıyor musunuz?",
  "termClosure_dialog": "Dönem kapanış işlemini onaylıyor musunuz?",
  "label_welcome": "Hoşgeldiniz",
  "label_track_manage": "Operasyonlarınızı takip edin ve yönetin.",
  "expense_project_disabled": "Masraf projesi aktif değildir. Onaya gönderilemez.",

  "operation_failed_login": "Girilen bilgiler aynı. E-Mail veya şifreyi değiştirip tekrar deneyiniz"
}
