module go.test/local

go 1.13

require (
	github.com/Syfaro/telegram-bot-api v4.6.4+incompatible
	github.com/go-telegram-bot-api/telegram-bot-api v4.6.4+incompatible // indirect
	github.com/gorilla/mux v1.8.0
	github.com/technoweenie/multipartstreamer v1.0.1 // indirect
)
