찬송가 250장 (구주의 십자가 보혈로/荣耀归主名)
https://www.hymnal.net/en/hymn/ch/739?gb=1

1 在十字架我救主舍命
  所流宝血洗罪有权能
  这宝贝血已将我洗清
  荣耀归主名！

  荣耀归主名！
  荣耀归主名！
  主宝贝血已将我洗清
  荣耀归主名！

2 十字架下救主施恩典
  用祂宝血洗净我罪愆
  哦，这洗净奇妙而甘甜
  荣耀归主名！

  荣耀归主名！
  荣耀归主名！
  主宝贝血已将我洗清
  荣耀归主名！

3 这宝贝血洗我何清洁
  我真快乐，我今白如雪！
  这血还要使我常超越
  荣耀归主名！


  荣耀归主名！
  荣耀归主名！
  主宝贝血已将我洗清
  荣耀归主名！

4 请你速来投入这泉源
  将你全人抛在主脚前
  今天来投，今天得完全
  荣耀归主名！

  荣耀归主名！
  荣耀归主名！
  主宝贝血已将我洗清
  荣耀归主名！