{"DepartureTime":"09:00","RouteName":"Amersfoort - Amsterdam","ArrivalTime":"10:00"},
{"DepartureTime":"10:00","RouteName":"Amersfoort - Amsterdam","ArrivalTime":"11:00"},
{"DepartureTime":"11:00","RouteName":"Amersfoort - Amsterdam","ArrivalTime":"12:00"},
{"DepartureTime":"10:30","RouteName":"Amersfoort - Amsterdam","ArrivalTime":"11:30"},
{"DepartureTime":"11:30","RouteName":"Amersfoort - Amsterdam","ArrivalTime":"12:30"},
{"DepartureTime":"13:00","RouteName":"Amersfoort - Amsterdam","ArrivalTime":"14:00"},
{"DepartureTime":"19:00","RouteName":"Amersfoort - Amsterdam","ArrivalTime":"20:00"},
{"DepartureTime":"10:00","RouteName":"Amersfoort - Utrecht","ArrivalTime":"10:20"},
{"DepartureTime":"10:40","RouteName":"Amersfoort - Utrecht","ArrivalTime":"11:00"},
{"DepartureTime":"11:00","RouteName":"Amersfoort - Utrecht","ArrivalTime":"11:20"},
{"DepartureTime":"11:40","RouteName":"Amersfoort - Utrecht","ArrivalTime":"12:00"},
{"DepartureTime":"12:00","RouteName":"Amersfoort - Utrecht","ArrivalTime":"12:20"},
{"DepartureTime":"12:20","RouteName":"Amersfoort - Utrecht","ArrivalTime":"12:40"},
{"DepartureTime":"12:40","RouteName":"Amersfoort - Utrecht","ArrivalTime":"13:00"},
{"DepartureTime":"13:20","RouteName":"Amersfoort - Utrecht","ArrivalTime":"13:40"},
{"DepartureTime":"14:00","RouteName":"Amersfoort - Utrecht","ArrivalTime":"14:20"},
{"DepartureTime":"14:20","RouteName":"Amersfoort - Utrecht","ArrivalTime":"14:40"},
{"DepartureTime":"21:00","RouteName":"Amersfoort - Utrecht","ArrivalTime":"21:20"},
{"DepartureTime":"23:00","RouteName":"Amersfoort - Utrecht","ArrivalTime":"23:20"},
{"DepartureTime":"11:00","RouteName":"Amersfoort - Groningen","ArrivalTime":"12:00"},
{"DepartureTime":"11:30","RouteName":"Amersfoort - Groningen","ArrivalTime":"12:30"},
{"DepartureTime":"11:45","RouteName":"Amersfoort - Groningen","ArrivalTime":"12:45"},
{"DepartureTime":"12:45","RouteName":"Amersfoort - Groningen","ArrivalTime":"13:45"},
{"DepartureTime":"13:45","RouteName":"Amersfoort - Groningen","ArrivalTime":"14:45"},
{"DepartureTime":"14:45","RouteName":"Amersfoort - Groningen","ArrivalTime":"15:45"},
{"DepartureTime":"15:45","RouteName":"Amersfoort - Groningen","ArrivalTime":"16:45"},
{"DepartureTime":"12:00","RouteName":"Amersfoort - Alkmaar","ArrivalTime":"13:00"},
{"DepartureTime":"08:00","RouteName":"Amsterdam - Utrecht","ArrivalTime":"11:30"},
{"DepartureTime":"11:00","RouteName":"Amsterdam - Utrecht","ArrivalTime":"11:30"},
{"DepartureTime":"11:30","RouteName":"Amsterdam - Utrecht","ArrivalTime":"12:45"},
{"DepartureTime":"12:15","RouteName":"Amsterdam - Utrecht","ArrivalTime":"12:45"},
{"DepartureTime":"12:45","RouteName":"Amsterdam - Utrecht","ArrivalTime":"13:00"},
{"DepartureTime":"14:45","RouteName":"Amsterdam - Utrecht","ArrivalTime":"15:15"},
{"DepartureTime":"16:30","RouteName":"Amsterdam - Utrecht","ArrivalTime":"18:00"},
{"DepartureTime":"08:00","RouteName":"Amsterdam - Amersfoort","ArrivalTime":"11:00"},
{"DepartureTime":"08:00","RouteName":"Amsterdam - Groningen","ArrivalTime":"11:30"},
{"DepartureTime":"08:00","RouteName":"Amsterdam - Alkmaar","ArrivalTime":"10:00"},
{"DepartureTime":"08:00","RouteName":"Alkmaar - Utrecht","ArrivalTime":"10:00"},
{"DepartureTime":"11:00","RouteName":"Alkmaar - Utrecht","ArrivalTime":"11:30"},
{"DepartureTime":"11:00","RouteName":"Alkmaar - Amersfoort","ArrivalTime":"12:45"},
{"DepartureTime":"11:00","RouteName":"Alkmaar - Groningen","ArrivalTime":"13:00"},
{"DepartureTime":"08:00","RouteName":"Alkmaar - Amsterdam","ArrivalTime":"11:00"},
{"DepartureTime":"11:00","RouteName":"Alkmaar - Amsterdam","ArrivalTime":"11:30"},
{"DepartureTime":"10:00","RouteName":"Alkmaar - Amsterdam","ArrivalTime":"13:00"},
{"DepartureTime":"12:45","RouteName":"Alkmaar - Amsterdam","ArrivalTime":"13:00"},