module gitlab.com/k.kulvik/grpcssl

go 1.15

require (
	github.com/golang/protobuf v1.4.2
	golang.org/x/net v0.0.0-20200904194848-62affa334b73
	google.golang.org/grpc v1.31.1
	google.golang.org/protobuf v1.25.0
)
