Name,Impact,Location,Source,Comment
VHL,Inactivation,3p,TCGA,
PBRM1,Inactivation,3p,TCGA,
BAP1,Inactivation,3p,TCGA,
SETD2,Inactivation,3p,TCGA,
KDM5C,Inactivation,Xp11.22,TCGA,
PIK3CA,Activation,3q26.32,TCGA,
PTEN,Inactivation,10q23.31,TCGA,
MTOR,Inactivation,1p36.22,TCGA,
MYC,Activation,8q24.21,TCGA,
TSC1,Inactivation,9q34.13,TracerX,
TSC2,Inactivation,16p13.3,TracerX,
ARID1A,Inactivation,1p36.11,TracerX,
TCEB1,Inactivation,8q21.11,TracerX,Known as ELOC now
CSMD3,Inactivation,8q23.3,TracerX,
