"log2_FC_input","gene_selection","Label"
"BLCA","50_most_significant","0.22 (8.09975563827349e-07)"
"BRCA","50_most_significant","0.1 (0.0246810517755637)"
"CHOL","50_most_significant","-0.02 (0.688686203194004)"
"COAD","50_most_significant","0.01 (0.774905491141837)"
"ESCA","50_most_significant","0.09 (0.0337301753627667)"
"GBM","50_most_significant","0.22 (3.31706283969484e-07)"
"KICH","50_most_significant","-0.18 (5.35912163729441e-05)"
"KIRC","50_most_significant","0 (0.929283967648246)"
"KIRP","50_most_significant","0.12 (0.00656952531718821)"
"LIHC","50_most_significant","0.14 (0.00113512133442136)"
"LUAD","50_most_significant","0.07 (0.100043300810558)"
"LUSC","50_most_significant","0.08 (0.057850035463225)"
"PAAD","50_most_significant","0.06 (0.178381556920235)"
"PRAD","50_most_significant","0.13 (0.00337026723661335)"
"SARC","50_most_significant","0.06 (0.167351502102674)"
"STAD","50_most_significant","0.24 (8.39970645243316e-08)"
"THCA","50_most_significant","-0.08 (0.0773114864149997)"
"UCEC","50_most_significant","0.14 (0.00145613324986176)"
"BLCA","100_most_significant","0.24 (7.52026525857216e-08)"
"BRCA","100_most_significant","0.12 (0.0071937557361294)"
"CHOL","100_most_significant","-0.03 (0.444843639051579)"
"COAD","100_most_significant","0.14 (0.00171273844525113)"
"ESCA","100_most_significant","0.13 (0.00323717613322502)"
"GBM","100_most_significant","0.17 (0.000159443921035369)"
"KICH","100_most_significant","-0.11 (0.0100767189071554)"
"KIRC","100_most_significant","0 (0.913956894660999)"
"KIRP","100_most_significant","0.07 (0.1374647225969)"
"LIHC","100_most_significant","0.14 (0.00118033435235545)"
"LUAD","100_most_significant","0.23 (2.27769566431419e-07)"
"LUSC","100_most_significant","0.13 (0.00343591989629342)"
"PAAD","100_most_significant","0.09 (0.0454681879468579)"
"PRAD","100_most_significant","0.12 (0.00658015903837242)"
"SARC","100_most_significant","0.08 (0.0623526121181448)"
"STAD","100_most_significant","0.21 (1.2616957893801e-06)"
"THCA","100_most_significant","-0.05 (0.276593890785202)"
"UCEC","100_most_significant","0.16 (0.000265466218028892)"
"BLCA","150_most_significant","0.28 (1.91189092511839e-10)"
"BRCA","150_most_significant","0.13 (0.00450668562341932)"
"CHOL","150_most_significant","0.02 (0.611598290869641)"
"COAD","150_most_significant","0.18 (2.98587688399902e-05)"
"ESCA","150_most_significant","0.13 (0.00277969362263027)"
"GBM","150_most_significant","0.27 (4.00636893563641e-10)"
"KICH","150_most_significant","-0.05 (0.305163598614257)"
"KIRC","150_most_significant","0.01 (0.838937062787102)"
"KIRP","150_most_significant","0.12 (0.00789395682821994)"
"LIHC","150_most_significant","0.2 (7.1092082550456e-06)"
"LUAD","150_most_significant","0.19 (1.31240363187581e-05)"
"LUSC","150_most_significant","0.22 (6.90114067522311e-07)"
"PAAD","150_most_significant","0.15 (0.000484007932231821)"
"PRAD","150_most_significant","0.13 (0.00481566876727178)"
"SARC","150_most_significant","0.11 (0.0151715956950301)"
"STAD","150_most_significant","0.25 (1.43998940220552e-08)"
"THCA","150_most_significant","-0.02 (0.669482970903031)"
"UCEC","150_most_significant","0.15 (0.000565088688239539)"
"BLCA","Bin_Chen_original","0.24 (4.6649745709176e-08)"
"BRCA","Bin_Chen_original","0.16 (0.000332007446555163)"
"CHOL","Bin_Chen_original","0.03 (0.452956810273941)"
"COAD","Bin_Chen_original","0.01 (0.875686145400079)"
"ESCA","Bin_Chen_original","0.17 (0.000118254132565581)"
"GBM","Bin_Chen_original","0.24 (6.21048152753872e-08)"
"KICH","Bin_Chen_original","-0.01 (0.880324416521812)"
"KIRC","Bin_Chen_original","0.1 (0.0236805214846212)"
"KIRP","Bin_Chen_original","0.15 (0.000723941507271683)"
"LIHC","Bin_Chen_original","0.26 (2.14116348755257e-09)"
"LUAD","Bin_Chen_original","0.24 (4.70051484788271e-08)"
"LUSC","Bin_Chen_original","0.24 (4.3568556413863e-08)"
"PRAD","Bin_Chen_original","0.17 (0.000115153466452856)"
"SARC","Bin_Chen_original","-0.04 (0.391513158377412)"
"STAD","Bin_Chen_original","0.15 (0.000551501909132123)"
"THCA","Bin_Chen_original","0.13 (0.00324042426555142)"
"UCEC","Bin_Chen_original","0.18 (3.03627345409584e-05)"
