"log2_FC_input","gene_selection","Label"
"BLCA","50_most_significant","-0.01 (0.862888551005127)"
"BRCA","50_most_significant","0.02 (0.611270337112979)"
"CHOL","50_most_significant","0 (0.936238630172188)"
"COAD","50_most_significant","0.02 (0.69011851835984)"
"ESCA","50_most_significant","0.11 (0.0124789167614828)"
"GBM","50_most_significant","-0.03 (0.567865619268328)"
"KICH","50_most_significant","-0.11 (0.00989102051526375)"
"KIRC","50_most_significant","-0.03 (0.50739527962917)"
"KIRP","50_most_significant","-0.07 (0.142478558681177)"
"LIHC","50_most_significant","-0.01 (0.847030856439175)"
"LUAD","50_most_significant","-0.05 (0.237492887059944)"
"LUSC","50_most_significant","0.01 (0.738844260136134)"
"PAAD","50_most_significant","-0.13 (0.0025395120088987)"
"PRAD","50_most_significant","-0.05 (0.306958450503608)"
"SARC","50_most_significant","-0.18 (4.13977135054062e-05)"
"STAD","50_most_significant","0.1 (0.0202029333416503)"
"THCA","50_most_significant","0.07 (0.114623776604846)"
"UCEC","50_most_significant","0.05 (0.309713637272632)"
"BLCA","100_most_significant","0.04 (0.416434932944478)"
"BRCA","100_most_significant","0.03 (0.516169757636326)"
"CHOL","100_most_significant","-0.12 (0.00651153744897743)"
"COAD","100_most_significant","0.01 (0.903841250180397)"
"ESCA","100_most_significant","0.11 (0.0118568635830265)"
"GBM","100_most_significant","0 (0.948526089026115)"
"KICH","100_most_significant","-0.15 (0.000493216893475618)"
"KIRC","100_most_significant","0.05 (0.259677999862836)"
"KIRP","100_most_significant","-0.03 (0.493496754933877)"
"LIHC","100_most_significant","-0.03 (0.487629956237039)"
"LUAD","100_most_significant","0.02 (0.679164002996806)"
"LUSC","100_most_significant","0.03 (0.475386185495375)"
"PAAD","100_most_significant","-0.06 (0.183230803498256)"
"PRAD","100_most_significant","-0.03 (0.567209288969521)"
"SARC","100_most_significant","-0.06 (0.187301527087972)"
"STAD","100_most_significant","0.06 (0.14808105909554)"
"THCA","100_most_significant","0.02 (0.653043578486173)"
"UCEC","100_most_significant","0.03 (0.473045115541779)"
"BLCA","150_most_significant","0.05 (0.271320351363099)"
"BRCA","150_most_significant","0.04 (0.424349026324656)"
"CHOL","150_most_significant","-0.05 (0.249719659672536)"
"COAD","150_most_significant","0.01 (0.744306910895627)"
"ESCA","150_most_significant","0.14 (0.0014643333253847)"
"GBM","150_most_significant","0.05 (0.24547039688207)"
"KICH","150_most_significant","-0.1 (0.0209983350865697)"
"KIRC","150_most_significant","0.08 (0.0837517860043055)"
"KIRP","150_most_significant","-0.02 (0.715379895959665)"
"LIHC","150_most_significant","0.01 (0.748082626767968)"
"LUAD","150_most_significant","0.03 (0.548157292561902)"
"LUSC","150_most_significant","0.04 (0.400125065929789)"
"PAAD","150_most_significant","-0.06 (0.16998789460271)"
"PRAD","150_most_significant","-0.02 (0.679502470899171)"
"SARC","150_most_significant","-0.03 (0.461085915342261)"
"STAD","150_most_significant","0.06 (0.194631815384076)"
"THCA","150_most_significant","-0.08 (0.0792163765130615)"
"UCEC","150_most_significant","0.06 (0.159098154135843)"
"BLCA","Bin_Chen_original","-0.01 (0.805624794518556)"
"BRCA","Bin_Chen_original","0.04 (0.379671415994631)"
"CHOL","Bin_Chen_original","0.03 (0.479037563922178)"
"COAD","Bin_Chen_original","-0.02 (0.612845334523002)"
"ESCA","Bin_Chen_original","0.05 (0.27923543984341)"
"GBM","Bin_Chen_original","0.02 (0.694137952437533)"
"KICH","Bin_Chen_original","-0.05 (0.221257419572946)"
"KIRC","Bin_Chen_original","0.05 (0.217928563526825)"
"KIRP","Bin_Chen_original","0.07 (0.120243776398531)"
"LIHC","Bin_Chen_original","0.04 (0.394408173688924)"
"LUAD","Bin_Chen_original","-0.01 (0.864591807403699)"
"LUSC","Bin_Chen_original","0 (0.933481157234526)"
"PRAD","Bin_Chen_original","0.01 (0.864256114812743)"
"SARC","Bin_Chen_original","-0.08 (0.0645734864550044)"
"STAD","Bin_Chen_original","0.03 (0.559440597417491)"
"THCA","Bin_Chen_original","-0.03 (0.438967123852719)"
"UCEC","Bin_Chen_original","-0.02 (0.734126491069698)"
