TCGA_tumor,TCGA_description,PRISM_primary_tissue,PRISM_secondary_tissue,PRISM_tertiary_tissue
BLCA,Bladder Urothelial Carcinoma,urinary_tract,-,-
BRCA,Breast invasive carcinoma,breast,-,-
CESC,Cervical squamous cell carcinoma and endocervical adenocarcinoma,-,-,-
CHOL,Cholangiocarcinoma,-,cholangiocarcinoma,-
COAD,Colon adenocarcinoma,colorectal,-,-
ESCA,Esophageal carcinoma,esophagus,-,-
GBM,Glioblastoma multiforme,-,glioma,-
HNSC,Head and Neck squamous cell carcinoma,-,-,-
KICH,Kidney Chromophobe,kidney,-,-
KIRC,Kidney renal clear cell carcinoma,kidney,-,-
KIRP,Kidney renal papillary cell carcinoma,kidney,-,-
LIHC,Liver hepatocellular carcinoma,liver,-,-
LUAD,Lung adenocarcinoma,-,-,lung_adenocarcinoma
LUSC,Lung squamous cell carcinoma,-,-,lung_squamous
PAAD,Pancreatic adenocarcinoma,pancreas,-,-
PCPG,Pheochromocytoma and Paraganglioma,-,-,-
PRAD,Prostate adenocarcinoma,prostate,-,-
READ,Rectum adenocarcinoma,-,-,-
SARC,Sarcoma,soft_tissue,-,-
STAD,Stomach adenocarcinoma,-,gastric_adenocarcinoma,
THCA,Thyroid carcinoma,thyroid,-,-
THYM,Thymoma,-,-,-
UCEC,Uterine Corpus Endometrial Carcinoma,-,uterus_endometrium,-