{
	".rpm_fedora": "dnf-plugins-core",
	".deb_debian": null,
	"flatpak": null,
	".exe_winget": null,
	".exe_chocolatey": null,
	"interface": "cli",
	"COMMENT": null
}
{
	".rpm_fedora": "info",
	".deb_debian": "info",
	"flatpak": null,
	".exe_winget": null,
	".exe_chocolatey": null,
	"interface": "cli",
	"COMMENT": null
}
{
	".rpm_fedora": "pinfo",
	".deb_debian": "pinfo",
	"flatpak": null,
	".exe_winget": null,
	".exe_chocolatey": null,
	"interface": "cli",
	"COMMENT": null
}
{
	".rpm_fedora": "curl",
	".deb_debian": "curl",
	"flatpak": null,
	".exe_winget": null,
	".exe_chocolatey": null,
	"interface": "cli",
	"COMMENT": null
}
{
	".rpm_fedora": "tmux",
	".deb_debian": "tmux",
	"flatpak": null,
	".exe_winget": null,
	".exe_chocolatey": null,
	"interface": "cli",
	"COMMENT": null
}
{
	".rpm_fedora": "w3m",
	".deb_debian": "w3m",
	"flatpak": null,
	".exe_winget": null,
	".exe_chocolatey": null,
	"interface": "cli",
	"COMMENT": null
}
{
	".rpm_fedora": "syncthing",
	".deb_debian": "syncthing",
	"flatpak": null,
	".exe_winget": "Syncthing.Syncthing",
	".exe_chocolatey": null,
	"interface": "cli",
	"COMMENT": null
}
{
	".rpm_fedora": "borgbackup",
	".deb_debian": "borgbackup",
	"flatpak": null,
	".exe_winget": null,
	".exe_chocolatey": null,
	"interface": "cli",
	"COMMENT": null
}
{
	".rpm_fedora": "fuse",
	".deb_debian": "fuse",
	"flatpak": null,
	".exe_winget": null,
	".exe_chocolatey": null,
	"interface": "cli",
	"COMMENT": null
}
{
	".rpm_fedora": "newsboat",
	".deb_debian": "newsboat",
	"flatpak": null,
	".exe_winget": null,
	".exe_chocolatey": null,
	"interface": "cli",
	"COMMENT": null
}
{
	".rpm_fedora": "jq",
	".deb_debian": "jq",
	"flatpak": null,
	".exe_winget": null,
	".exe_chocolatey": null,
	"interface": "cli",
	"COMMENT": null
}
{
	".rpm_fedora": "pandoc",
	".deb_debian": "pandoc",
	"flatpak": null,
	".exe_winget": "JohnMacFarlane.Pandoc",
	".exe_chocolatey": null,
	"interface": "cli",
	"COMMENT": null
}
{
	".rpm_fedora": "neovim",
	".deb_debian": "neovim",
	"flatpak": null,
	".exe_winget": "Neovim.Neovim",
	".exe_chocolatey": null,
	"interface": "cli",
	"COMMENT": null
}
{
	".rpm_fedora": "bat",
	".deb_debian": "bat",
	"flatpak": null,
	".exe_winget": "sharkdp.bat",
	".exe_chocolatey": null,
	"interface": "cli",
	"COMMENT": null
}
{
	".rpm_fedora": "eza",
	".deb_debian": "eza",
	"flatpak": null,
	".exe_winget": "eza-community.eza",
	".exe_chocolatey": null,
	"interface": "cli",
	"COMMENT": "gleichwieexa?"
}
{
	".rpm_fedora": "fd-find",
	".deb_debian": "fd-find",
	"flatpak": null,
	".exe_winget": "sharkdp.fd",
	".exe_chocolatey": null,
	"interface": "cli",
	"COMMENT": null
}
{
	".rpm_fedora": "ripgrep",
	".deb_debian": "ripgrep",
	"flatpak": null,
	".exe_winget": "BurntSushi.ripgrep.GNU",
	".exe_chocolatey": null,
	"interface": "cli",
	"COMMENT": null
}
{
	".rpm_fedora": "fzf",
	".deb_debian": "fzf",
	"flatpak": null,
	".exe_winget": "junegunn.fzf",
	".exe_chocolatey": null,
	"interface": "cli",
	"COMMENT": null
}
{
	".rpm_fedora": "pdfgrep",
	".deb_debian": "pdfgrep",
	"flatpak": null,
	".exe_winget": null,
	".exe_chocolatey": null,
	"interface": "cli",
	"COMMENT": "bessermitripgrep?"
}
{
	".rpm_fedora": null,
	".deb_debian": null,
	"flatpak": null,
	".exe_winget": null,
	".exe_chocolatey": null,
	"interface": "cli",
	"COMMENT": "xsv"
}
{
	".rpm_fedora": "unzip",
	".deb_debian": "unzip",
	"flatpak": null,
	".exe_winget": null,
	".exe_chocolatey": null,
	"interface": "cli",
	"COMMENT": null
}
{
	".rpm_fedora": "net-tools",
	".deb_debian": "net-tools",
	"flatpak": null,
	".exe_winget": null,
	".exe_chocolatey": null,
	"interface": "cli",
	"COMMENT": "nochnotwendig?"
}
{
	".rpm_fedora": "nmon",
	".deb_debian": "nmon",
	"flatpak": null,
	".exe_winget": null,
	".exe_chocolatey": null,
	"interface": "cli",
	"COMMENT": null
}
{
	".rpm_fedora": "minicom",
	".deb_debian": null,
	"flatpak": null,
	".exe_winget": null,
	".exe_chocolatey": null,
	"interface": "cli",
	"COMMENT": null
}
{
	".rpm_fedora": "iftop",
	".deb_debian": "iftop",
	"flatpak": null,
	".exe_winget": null,
	".exe_chocolatey": null,
	"interface": "cli",
	"COMMENT": null
}
{
	".rpm_fedora": "iptraf",
	".deb_debian": "iptraf",
	"flatpak": null,
	".exe_winget": null,
	".exe_chocolatey": null,
	"interface": "cli",
	"COMMENT": null
}
{
	".rpm_fedora": "traceroute",
	".deb_debian": "traceroute",
	"flatpak": null,
	".exe_winget": null,
	".exe_chocolatey": null,
	"interface": "cli",
	"COMMENT": null
}
{
	".rpm_fedora": "nmap",
	".deb_debian": "nmap",
	"flatpak": null,
	".exe_winget": "Insecure.Nmap",
	".exe_chocolatey": null,
	"interface": "cli",
	"COMMENT": null
}
{
	".rpm_fedora": "netcat",
	".deb_debian": "netcat",
	"flatpak": null,
	".exe_winget": "Insecure.Nmap",
	".exe_chocolatey": null,
	"interface": "cli",
	"COMMENT": null
}
{
	".rpm_fedora": "iperf",
	".deb_debian": "iperf",
	"flatpak": null,
	".exe_winget": null,
	".exe_chocolatey": null,
	"interface": "cli",
	"COMMENT": null
}
{
	".rpm_fedora": "wireguard-tools",
	".deb_debian": "wireguard-tools",
	"flatpak": null,
	".exe_winget": "WireGuard.WireGuard",
	".exe_chocolatey": null,
	"interface": "cli",
	"COMMENT": null
}
{
	".rpm_fedora": "mtr",
	".deb_debian": "mtr",
	"flatpak": null,
	".exe_winget": null,
	".exe_chocolatey": null,
	"interface": "cli",
	"COMMENT": null
}
{
	".rpm_fedora": "exabgp",
	".deb_debian": "exabgp",
	"flatpak": null,
	".exe_winget": null,
	".exe_chocolatey": null,
	"interface": "cli",
	"COMMENT": null
}
{
	".rpm_fedora": "blueman",
	".deb_debian": null,
	"flatpak": null,
	".exe_winget": null,
	".exe_chocolatey": null,
	"interface": "cli",
	"COMMENT": null
}
{
	".rpm_fedora": "python3",
	".deb_debian": "python3",
	"flatpak": null,
	".exe_winget": "python3",
	".exe_chocolatey": null,
	"interface": "cli",
	"COMMENT": null
}
{
	".rpm_fedora": "python3-pip",
	".deb_debian": "python3-pip",
	"flatpak": null,
	".exe_winget": null,
	".exe_chocolatey": null,
	"interface": "cli",
	"COMMENT": null
}
{
	".rpm_fedora": "python3-neovim",
	".deb_debian": "python3-neovim",
	"flatpak": null,
	".exe_winget": null,
	".exe_chocolatey": null,
	"interface": "cli",
	"COMMENT": null
}
{
	".rpm_fedora": "python3-tasklib",
	".deb_debian": "python3-tasklib",
	"flatpak": null,
	".exe_winget": null,
	".exe_chocolatey": null,
	"interface": "cli",
	"COMMENT": null
}
{
	".rpm_fedora": "g++",
	".deb_debian": "g++",
	"flatpak": null,
	".exe_winget": "LLVM.LLVM",
	".exe_chocolatey": null,
	"interface": "cli",
	"COMMENT": null
}
{
	".rpm_fedora": "ansible",
	".deb_debian": "ansible",
	"flatpak": null,
	".exe_winget": null,
	".exe_chocolatey": null,
	"interface": "cli",
	"COMMENT": null
}
{
	".rpm_fedora": "task",
	".deb_debian": "taskwarrior",
	"flatpak": null,
	".exe_winget": null,
	".exe_chocolatey": null,
	"interface": "cli",
	"COMMENT": null
}
{
	".rpm_fedora": "p7zip",
	".deb_debian": "p7zip-full",
	"flatpak": null,
	".exe_winget": null,
	".exe_chocolatey": null,
	"interface": "cli",
	"COMMENT": null
}
{
	".rpm_fedora": "iputils",
	".deb_debian": "iputils-arping",
	"flatpak": null,
	".exe_winget": null,
	".exe_chocolatey": null,
	"interface": "cli",
	"COMMENT": null
}
{
	".rpm_fedora": "iputils",
	".deb_debian": "iputils-clockdiff",
	"flatpak": null,
	".exe_winget": null,
	".exe_chocolatey": null,
	"interface": "cli",
	"COMMENT": null
}
{
	".rpm_fedora": "iputils",
	".deb_debian": "iputils-ping",
	"flatpak": null,
	".exe_winget": null,
	".exe_chocolatey": null,
	"interface": "cli",
	"COMMENT": null
}
{
	".rpm_fedora": "iputils",
	".deb_debian": "iputils-tracepath",
	"flatpak": null,
	".exe_winget": null,
	".exe_chocolatey": null,
	"interface": "cli",
	"COMMENT": null
}
{
	".rpm_fedora": "iproute",
	".deb_debian": "iproute2",
	"flatpak": null,
	".exe_winget": null,
	".exe_chocolatey": null,
	"interface": "cli",
	"COMMENT": null
}
{
	".rpm_fedora": "iproute-doc",
	".deb_debian": "iproute2-doc",
	"flatpak": null,
	".exe_winget": null,
	".exe_chocolatey": null,
	"interface": "cli",
	"COMMENT": null
}
{
	".rpm_fedora": "network-scripts",
	".deb_debian": null,
	"flatpak": null,
	".exe_winget": null,
	".exe_chocolatey": null,
	"interface": "cli",
	"COMMENT": null
}
{
	".rpm_fedora": null,
	".deb_debian": "ifupdown2",
	"flatpak": null,
	".exe_winget": null,
	".exe_chocolatey": null,
	"interface": "cli",
	"COMMENT": null
}
{
	".rpm_fedora": null,
	".deb_debian": "oping",
	"flatpak": null,
	".exe_winget": null,
	".exe_chocolatey": null,
	"interface": "cli",
	"COMMENT": null
}
{
	".rpm_fedora": "nfs-utils",
	".deb_debian": "nfs-common",
	"flatpak": null,
	".exe_winget": null,
	".exe_chocolatey": null,
	"interface": "cli",
	"COMMENT": null
}
{
	".rpm_fedora": "bind-utils",
	".deb_debian": "dnsutils",
	"flatpak": null,
	".exe_winget": null,
	".exe_chocolatey": null,
	"interface": "cli",
	"COMMENT": null
}
{
	".rpm_fedora": "npm",
	".deb_debian": "npm",
	"flatpak": null,
	".exe_winget": "OpenJS.NodeJS",
	".exe_chocolatey": null,
	"interface": "cli",
	"COMMENT": null
}
{
	".rpm_fedora": null,
	".deb_debian": "shellcheck",
	"flatpak": null,
	".exe_winget": null,
	".exe_chocolatey": null,
	"interface": "cli",
	"COMMENT": null
}
{
	".rpm_fedora": "pl",
	".deb_debian": "swi-prolog",
	"flatpak": null,
	".exe_winget": null,
	".exe_chocolatey": null,
	"interface": "cli",
	"COMMENT": null
}
{
	".rpm_fedora": "nodejs-bash-language-server",
	".deb_debian": null,
	"flatpak": null,
	".exe_winget": null,
	".exe_chocolatey": null,
	"interface": "cli",
	"COMMENT": null
}
{
	".rpm_fedora": null,
	".deb_debian": null,
	"flatpak": null,
	".exe_winget": "Chocolatey.Chocolatey",
	".exe_chocolatey": null,
	"interface": "cli",
	"COMMENT": null
}
{
	".rpm_fedora": null,
	".deb_debian": null,
	"flatpak": null,
	".exe_winget": "Microsoft.WindowsTerminal",
	".exe_chocolatey": null,
	"interface": "gui",
	"COMMENT": null
}
{
	".rpm_fedora": null,
	".deb_debian": null,
	"flatpak": null,
	".exe_winget": "Microsoft.PowerShell",
	".exe_chocolatey": null,
	"interface": "cli",
	"COMMENT": null
}
{
	".rpm_fedora": null,
	".deb_debian": null,
	"flatpak": null,
	".exe_winget": "Microsoft.PowerToys",
	".exe_chocolatey": null,
	"interface": "gui",
	"COMMENT": null
}
{
	".rpm_fedora": null,
	".deb_debian": null,
	"flatpak": null,
	".exe_winget": "Git.Git",
	".exe_chocolatey": null,
	"interface": "cli",
	"COMMENT": null
}
{
	".rpm_fedora": null,
	".deb_debian": null,
	"flatpak": null,
	".exe_winget": "GnuPG.GnuPG",
	".exe_chocolatey": null,
	"interface": "cli",
	"COMMENT": null
}
{
	".rpm_fedora": null,
	".deb_debian": null,
	"flatpak": null,
	".exe_winget": "frippery.busybox-w32",
	".exe_chocolatey": null,
	"interface": "cli",
	"COMMENT": null
}
{
	".rpm_fedora": "brave-browser",
	".deb_debian": "brave-browser",
	"flatpak": null,
	".exe_winget": "Brave.Brave",
	".exe_chocolatey": null,
	"interface": "gui",
	"COMMENT": null
}
{
	".rpm_fedora": "libreoffice",
	".deb_debian": "libreoffice",
	"flatpak": null,
	".exe_winget": "TheDocumentFoundation.LibreOffice",
	".exe_chocolatey": null,
	"interface": "gui",
	"COMMENT": null
}
{
	".rpm_fedora": "xournalpp",
	".deb_debian": "xournalpp",
	"flatpak": null,
	".exe_winget": "Xournal++.Xournal++",
	".exe_chocolatey": null,
	"interface": "gui",
	"COMMENT": null
}
{
	".rpm_fedora": "wireshark",
	".deb_debian": "wireshark",
	"flatpak": null,
	".exe_winget": "WiresharkFoundation.Wireshark",
	".exe_chocolatey": null,
	"interface": "gui",
	"COMMENT": null
}
{
	".rpm_fedora": null,
	".deb_debian": null,
	"flatpak": null,
	".exe_winget": "tailscale.tailscale",
	".exe_chocolatey": null,
	"interface": "gui",
	"COMMENT": null
}
{
	".rpm_fedora": null,
	".deb_debian": null,
	"flatpak": null,
	".exe_winget": "jftuga.less",
	".exe_chocolatey": null,
	"interface": "cli",
	"COMMENT": null
}
{
	".rpm_fedora": null,
	".deb_debian": null,
	"flatpak": null,
	".exe_winget": "gerardog.gsudo",
	".exe_chocolatey": null,
	"interface": "cli",
	"COMMENT": null
}
{
	".rpm_fedora": null,
	".deb_debian": null,
	"flatpak": null,
	".exe_winget": "gsass1.NTop",
	".exe_chocolatey": null,
	"interface": "cli",
	"COMMENT": null
}
{
	".rpm_fedora": "powershell",
	".deb_debian": null,
	"flatpak": null,
	".exe_winget": null,
	".exe_chocolatey": null,
	"interface": "cli",
	"COMMENT": null
}
{
	".rpm_fedora": "microsoft-edge-stable",
	".deb_debian": null,
	"flatpak": null,
	".exe_winget": null,
	".exe_chocolatey": null,
	"interface": "gui",
	"COMMENT": null
}
{
	".rpm_fedora": "podman",
	".deb_debian": null,
	"flatpak": null,
	".exe_winget": null,
	".exe_chocolatey": null,
	"interface": "cli",
	"COMMENT": null
}
{
	".rpm_fedora": "podman-docker",
	".deb_debian": null,
	"flatpak": null,
	".exe_winget": null,
	".exe_chocolatey": null,
	"interface": "cli",
	"COMMENT": null
}
{
	".rpm_fedora": "containerlab",
	".deb_debian": null,
	"flatpak": null,
	".exe_winget": null,
	".exe_chocolatey": null,
	"interface": "cli",
	"COMMENT": null
}
{
	".rpm_fedora": null,
	".deb_debian": null,
	"flatpak": null,
	".exe_winget": null,
	".exe_chocolatey": null,
	"interface": "cli",
	"COMMENT": null
}
{
	".rpm_fedora": null,
	".deb_debian": null,
	"flatpak": null,
	".exe_winget": "Docker.DockerCLI",
	".exe_chocolatey": null,
	"interface": "cli",
	"COMMENT": null
}
{
	".rpm_fedora": null,
	".deb_debian": null,
	"flatpak": null,
	".exe_winget": "Docker.DockerDesktop",
	".exe_chocolatey": null,
	"interface": "gui",
	"COMMENT": null
}
{
	".rpm_fedora": null,
	".deb_debian": null,
	"flatpak": "com.github.tchx84.Flatseal",
	".exe_winget": null,
	".exe_chocolatey": null,
	"interface": "gui",
	"COMMENT": null
}
{
	".rpm_fedora": null,
	".deb_debian": null,
	"flatpak": "com.valvesoftware.Steam",
	".exe_winget": null,
	".exe_chocolatey": null,
	"interface": "gui",
	"COMMENT": null
}
