<svg width="125" height="26" viewBox="0 0 125 26" fill="none" xmlns="http://www.w3.org/2000/svg">
<path d="M34.35 12.79C34.35 16.31 34.35 19.86 34.35 23.35H30.35V4.79H32.83L41.76 14.88V4.79H45.76V23.35H43.76L34.35 12.79Z" fill="black"/>
<path d="M48.91 4.79H61.91V8.6H53C53 9.82 53 11.04 53 12.28H60.52V16H53V19.52H62.2V23.36H48.88L48.91 4.79Z" fill="black"/>
<path d="M79 19.67V23.35H64.76V20.65L74 8.45H65V4.79H79.38V7.44L70.29 19.67H79Z" fill="black"/>
<path d="M90 23.61C84.84 23.61 81.69 19.88 81.71 14.08C81.71 11.08 81.71 7.84 81.71 4.79H85.71V13.63C85.71 17.79 87.43 19.48 89.92 19.48C92.17 19.48 93.92 17.37 93.92 13.48V4.79H97.99V13.85C98.06 19.86 95 23.61 90 23.61ZM84.59 0H95.39V2.44H84.59V0Z" fill="black"/>
<path d="M107.8 23.35H101V4.79H108.57C113.79 4.79 117.07 9.19 117.07 14.06C117 19.35 113.41 23.35 107.8 23.35ZM107.56 8.5H105.1C105.1 12.26 105.1 15.86 105.1 19.62H107.51C108.252 19.6653 108.996 19.5573 109.695 19.3028C110.394 19.0483 111.033 18.6526 111.572 18.1404C112.112 17.6283 112.54 17.0106 112.83 16.3258C113.121 15.641 113.267 14.9038 113.26 14.16C113.23 11.12 111.72 8.5 107.56 8.5Z" fill="black"/>
<path d="M120.24 4.79H124.37V23.35H120.24V4.79Z" fill="black"/>
<path d="M13 19.57C12.9469 19.6547 12.8732 19.7246 12.7857 19.773C12.6983 19.8214 12.6 19.8468 12.5 19.8468C12.4 19.8468 12.3017 19.8214 12.2142 19.773C12.1268 19.7246 12.0531 19.6547 12 19.57C11.72 19.11 11.44 18.64 11.17 18.17C10.9 17.7 10.48 17.01 10.17 16.42C9.8423 15.8596 9.55168 15.2784 9.3 14.68C9.15 14.3 8.99 13.92 8.87 13.53C8.78503 13.2186 8.72485 12.9009 8.69 12.58C8.65981 12.2975 8.65981 12.0125 8.69 11.73C8.67728 11.4859 8.69069 11.2412 8.73 11C8.80144 10.7599 8.89172 10.5259 9 10.3C9.2136 9.87876 9.50546 9.50205 9.85999 9.19C10.3426 8.76248 10.923 8.46026 11.55 8.31C11.9062 8.22192 12.2737 8.1882 12.64 8.21C13.1421 8.23468 13.6346 8.35696 14.09 8.57C14.4523 8.74669 14.7888 8.97211 15.09 9.24C15.4671 9.57049 15.7762 9.97129 16 10.42C16.1779 10.7918 16.2928 11.1905 16.34 11.6C16.395 11.9613 16.395 12.3287 16.34 12.69C16.34 12.98 16.21 13.27 16.14 13.56C15.9857 14.109 15.778 14.6415 15.52 15.15C15.32 15.57 15.1 15.98 14.87 16.39C14.64 16.8 14.24 17.5 13.87 18.05C13.5 18.6 13.32 18.97 13.05 19.43L13 19.57ZM12.49 10.91C12.2412 10.91 11.998 10.9837 11.791 11.1217C11.584 11.2597 11.4225 11.4559 11.3269 11.6855C11.2312 11.9152 11.2057 12.168 11.2535 12.4122C11.3013 12.6563 11.4204 12.8808 11.5956 13.0574C11.7708 13.234 11.9944 13.3548 12.2381 13.4046C12.4819 13.4543 12.7349 13.4308 12.9653 13.3369C13.1957 13.2431 13.3932 13.0832 13.5328 12.8773C13.6724 12.6714 13.748 12.4288 13.75 12.18C13.7529 12.0099 13.721 11.841 13.6562 11.6836C13.5915 11.5262 13.4954 11.3838 13.3737 11.2649C13.252 11.146 13.1073 11.0532 12.9484 10.9921C12.7896 10.9311 12.62 10.9032 12.45 10.91H12.49Z" fill="black"/>
<path d="M12.45 25.51C10.1834 25.51 7.96775 24.8379 6.08316 23.5786C4.19857 22.3194 2.72972 20.5296 1.86234 18.4356C0.994956 16.3415 0.768009 14.0373 1.2102 11.8143C1.65238 9.59124 2.74384 7.54927 4.34655 5.94656C5.94926 4.34385 7.99124 3.25239 10.2143 2.8102C12.4373 2.36801 14.7415 2.59496 16.8355 3.46234C18.9296 4.32972 20.7194 5.79858 21.9786 7.68317C23.2379 9.56775 23.91 11.7834 23.91 14.05C23.9073 17.0886 22.6991 20.0019 20.5505 22.1505C18.4019 24.2991 15.4886 25.5074 12.45 25.51ZM12.45 5.41C10.7412 5.41 9.07071 5.91673 7.64987 6.8661C6.22903 7.81548 5.12162 9.16486 4.46768 10.7436C3.81374 12.3224 3.64263 14.0596 3.97601 15.7356C4.30939 17.4116 5.13227 18.9511 6.34059 20.1594C7.54892 21.3677 9.08842 22.1906 10.7644 22.524C12.4404 22.8574 14.1776 22.6863 15.7564 22.0323C17.3351 21.3784 18.6845 20.271 19.6339 18.8501C20.5833 17.4293 21.09 15.7588 21.09 14.05C21.0847 11.7602 20.1727 9.5656 18.5536 7.94643C16.9344 6.32726 14.7398 5.41528 12.45 5.41Z" fill="black"/>
</svg>
