<svg width="239" height="55" viewBox="0 0 239 55" fill="none" xmlns="http://www.w3.org/2000/svg">
<g filter="url(#filter0_d_51_127)">
<path d="M65.9755 23.7132C65.9755 30.2394 65.9755 36.8213 65.9755 43.2919H58.5086V8.88087H63.1567L79.808 27.5882V8.88087H87.1629V43.2919H83.4295L65.9755 23.7132Z" fill="white"/>
<path d="M93.1551 8.88087H117.423V15.9448H100.865C100.865 18.2067 100.865 20.4686 100.865 22.7677H114.903V29.6647H100.865V36.1909H117.889V43.3105H93.0991L93.1551 8.88087Z" fill="white"/>
<path d="M149.344 36.469V43.2919H122.761V38.286L139.898 15.6667H123.097V8.88087H150.034V13.7941L133.085 36.469H149.344Z" fill="white"/>
<path d="M169.784 43.774C160.152 43.774 154.272 36.8584 154.328 26.1049C154.328 20.5428 154.328 14.5357 154.328 8.88087H161.944V25.2706C161.944 32.9834 165.155 36.1168 169.784 36.1168C174.003 36.1168 177.251 32.2047 177.251 24.9925V8.88087H184.868V25.6785C184.924 36.8213 179.137 43.774 169.784 43.774ZM159.76 0H179.921V4.52387H159.76V0Z" fill="white"/>
<path d="M203.087 43.2919H190.337V8.88087H204.487C214.213 8.88087 220.336 17.0387 220.336 26.0678C220.336 35.8757 213.578 43.2919 203.087 43.2919ZM202.658 15.7594H198.047C198.047 22.7306 198.047 29.4051 198.047 36.3763H202.546C203.93 36.4577 205.316 36.2556 206.619 35.7824C207.921 35.3093 209.112 34.5753 210.117 33.626C211.121 32.6767 211.919 31.5324 212.46 30.2641C213.001 28.9958 213.273 27.6306 213.261 26.2533C213.223 20.617 210.405 15.7594 202.658 15.7594Z" fill="white"/>
<path d="M226.309 8.88087H234.019V43.2919H226.309V8.88087Z" fill="white"/>
<path d="M25.9714 35.3937C25.8823 35.5436 25.7554 35.6678 25.6032 35.7542C25.4509 35.8405 25.2787 35.8859 25.1034 35.8859C24.9281 35.8859 24.7559 35.8405 24.6037 35.7542C24.4514 35.6678 24.3245 35.5436 24.2354 35.3937L22.8167 33.0205C22.238 32.0379 21.6406 31.0552 21.0993 30.054C20.5446 29.1038 20.052 28.1191 19.6246 27.1061C19.3632 26.4757 19.1019 25.8268 18.8965 25.2521C18.7353 24.733 18.6289 24.1986 18.5792 23.6576C18.5419 23.1763 18.5419 22.6928 18.5792 22.2114C18.615 21.8081 18.6964 21.4101 18.8219 21.0249C18.9357 20.6057 19.0986 20.2012 19.3072 19.8197C19.6704 19.116 20.1645 18.4869 20.7633 17.9657C21.5814 17.2401 22.5699 16.7301 23.638 16.4824C24.2482 16.3334 24.8776 16.2772 25.5048 16.3156C26.3654 16.3516 27.2098 16.5597 27.9875 16.9274C28.6011 17.2192 29.1674 17.6004 29.6676 18.0584C30.2842 18.6254 30.7849 19.3053 31.1423 20.0607C31.4447 20.6856 31.6402 21.356 31.721 22.0446C31.805 22.6598 31.805 23.2834 31.721 23.8986C31.721 24.3807 31.497 24.8813 31.385 25.3633C31.054 26.2459 30.6416 27.0962 30.1529 27.9034C29.8169 28.6264 29.4249 29.3124 29.0515 29.9984C28.6782 30.6844 27.9688 31.8525 27.4275 32.8166C26.8861 33.7807 26.4941 34.374 26.0274 35.1527L25.9714 35.3937ZM25.1127 20.2276C24.6476 20.224 24.1917 20.3574 23.8029 20.611C23.4141 20.8647 23.1097 21.2271 22.9283 21.6526C22.7469 22.078 22.6966 22.5474 22.7837 23.0012C22.8708 23.4551 23.0915 23.8731 23.4178 24.2023C23.7442 24.5316 24.1615 24.7574 24.617 24.8512C25.0725 24.9449 25.5458 24.9024 25.9769 24.7289C26.4081 24.5555 26.7779 24.259 27.0394 23.8769C27.3009 23.4948 27.4425 23.0443 27.4462 22.5822C27.4511 22.2748 27.3944 21.9694 27.2794 21.684C27.1643 21.3985 26.9932 21.1386 26.7761 20.9195C26.5589 20.7003 26.3 20.5263 26.0144 20.4075C25.7288 20.2887 25.4223 20.2276 25.1127 20.2276Z" fill="white"/>
<path d="M25.1127 47C20.9399 47.0037 16.8598 45.778 13.3884 43.4782C9.91707 41.1783 7.21049 37.9076 5.61106 34.0796C4.01164 30.2517 3.59124 26.0387 4.40305 21.9734C5.21486 17.9082 7.2224 14.1734 10.1717 11.2415C13.121 8.30964 16.8796 6.31244 20.972 5.50255C25.0643 4.69266 29.3066 5.10647 33.1621 6.69163C37.0176 8.27679 40.3132 10.9621 42.6319 14.4078C44.9505 17.8535 46.1881 21.9049 46.1881 26.0493C46.1832 31.6011 43.9618 36.9243 40.011 40.8517C36.0602 44.7791 30.7025 46.9902 25.1127 47ZM25.1127 9.73373C21.8629 9.73006 18.6851 10.6838 15.9812 12.4744C13.2773 14.2649 11.1689 16.8118 9.92265 19.7927C8.67645 22.7737 8.34847 26.0548 8.98021 29.2209C9.61195 32.3871 11.175 35.296 13.4717 37.5796C15.7683 39.8632 18.6953 41.419 21.8824 42.05C25.0695 42.6811 28.3734 42.359 31.3762 41.1247C34.379 39.8904 36.9456 37.7992 38.7515 35.1157C40.5574 32.4322 41.5213 29.277 41.5213 26.0493C41.5164 21.7269 39.7866 17.5826 36.711 14.5244C33.6354 11.4662 29.4648 9.74354 25.1127 9.73373Z" fill="white"/>
</g>
<defs>
<filter id="filter0_d_51_127" x="0" y="0" width="238.019" height="55" filterUnits="userSpaceOnUse" color-interpolation-filters="sRGB">
<feFlood flood-opacity="0" result="BackgroundImageFix"/>
<feColorMatrix in="SourceAlpha" type="matrix" values="0 0 0 0 0 0 0 0 0 0 0 0 0 0 0 0 0 0 127 0" result="hardAlpha"/>
<feOffset dy="4"/>
<feGaussianBlur stdDeviation="2"/>
<feComposite in2="hardAlpha" operator="out"/>
<feColorMatrix type="matrix" values="0 0 0 0 0 0 0 0 0 0 0 0 0 0 0 0 0 0 0.25 0"/>
<feBlend mode="normal" in2="BackgroundImageFix" result="effect1_dropShadow_51_127"/>
<feBlend mode="normal" in="SourceGraphic" in2="effect1_dropShadow_51_127" result="shape"/>
</filter>
</defs>
</svg>
